BDBM50212613 CHEMBL266122::Tyr-Pro-Dmp-Phe-NH2
SMILES: Cc1cccc(C)c1C[C@H](NC(=O)[C@@H]1CCCN1C(=O)[C@@H](N)Cc1ccc(O)cc1)C(=O)N[C@@H](Cc1ccccc1)C(N)=O
InChI Key: InChIKey=HJYUYBYISGYHKS-KRCBVYEFSA-N
Data: 3 KI  2 IC50
Activity Spreadsheet -- Enzyme Inhibition Constant Data from BindingDB
Found 5 hits for monomerid = 50212613
Trg + Lig
Ki
nM
ΔG°
kcal/mole
IC50
nM
Kd
nM
EC50/IC50
nM
koff
s-1
kon
M-1s-1
pHTemp
°C
Mu-type opioid receptor
(Rattus norvegicus (rat))
BDBM50212613
(CHEMBL266122 | Tyr-Pro-Dmp-Phe-NH2)
Show SMILES Cc1cccc(C)c1C[C@H](NC(=O)[C@@H]1CCCN1C(=O)[C@@H](N)Cc1ccc(O)cc1)C(=O)N[C@@H](Cc1ccccc1)C(N)=O
Show InChI InChI=1S/C34H41N5O5/c1-21-8-6-9-22(2)26(21)20-29(32(42)37-28(31(36)41)19-23-10-4-3-5-11-23)38-33(43)30-12-7-17-39(30)34(44)27(35)18-24-13-15-25(40)16-14-24/h3-6,8-11,13-16,27-30,40H,7,12,17-20,35H2,1-2H3,(H2,36,41)(H,37,42)(H,38,43)/t27-,28-,29-,30-/m0/s1
Reactome pathway
0.0440n/an/an/an/an/an/an/an/a
Kobe Gakuin University
Curated by ChEMBL
Assay Description
Displacement of [3H]DAMGO from mu opioid receptor in Sprague-Dawley rat brain P2 synaptosome membrane
J Med Chem 50: 2753-66 (2007)
Article DOI: 10.1021/jm061238m
BindingDB Entry DOI: 10.7270/Q25B0264
Opioid receptors; mu & delta
(Rattus norvegicus (rat))
BDBM50212613
(CHEMBL266122 | Tyr-Pro-Dmp-Phe-NH2)
Show SMILES Cc1cccc(C)c1C[C@H](NC(=O)[C@@H]1CCCN1C(=O)[C@@H](N)Cc1ccc(O)cc1)C(=O)N[C@@H](Cc1ccccc1)C(N)=O
Show InChI InChI=1S/C34H41N5O5/c1-21-8-6-9-22(2)26(21)20-29(32(42)37-28(31(36)41)19-23-10-4-3-5-11-23)38-33(43)30-12-7-17-39(30)34(44)27(35)18-24-13-15-25(40)16-14-24/h3-6,8-11,13-16,27-30,40H,7,12,17-20,35H2,1-2H3,(H2,36,41)(H,37,42)(H,38,43)/t27-,28-,29-,30-/m0/s1
Reactome pathway
1.44E+3n/an/an/an/an/an/an/an/a
Kobe Gakuin University
Curated by ChEMBL
Assay Description
Displacement of [3H]deltorphin 2 from delta opioid receptor in Sprague-Dawley rat brain P2 synaptosome membrane
J Med Chem 50: 2753-66 (2007)
Article DOI: 10.1021/jm061238m
BindingDB Entry DOI: 10.7270/Q25B0264
Kappa-type opioid receptor
(Cavia porcellus (domestic guinea pig))
BDBM50212613
(CHEMBL266122 | Tyr-Pro-Dmp-Phe-NH2)
Show SMILES Cc1cccc(C)c1C[C@H](NC(=O)[C@@H]1CCCN1C(=O)[C@@H](N)Cc1ccc(O)cc1)C(=O)N[C@@H](Cc1ccccc1)C(N)=O
Show InChI InChI=1S/C34H41N5O5/c1-21-8-6-9-22(2)26(21)20-29(32(42)37-28(31(36)41)19-23-10-4-3-5-11-23)38-33(43)30-12-7-17-39(30)34(44)27(35)18-24-13-15-25(40)16-14-24/h3-6,8-11,13-16,27-30,40H,7,12,17-20,35H2,1-2H3,(H2,36,41)(H,37,42)(H,38,43)/t27-,28-,29-,30-/m0/s1
>4.00E+3n/an/an/an/an/an/an/an/a
Kobe Gakuin University
Curated by ChEMBL
Assay Description
Displacement of [3H]U69,593 from kappa opioid receptor in Hartley guinea pig cerebellum P2 synaptosome membrane
J Med Chem 50: 2753-66 (2007)
Article DOI: 10.1021/jm061238m
BindingDB Entry DOI: 10.7270/Q25B0264
Delta-type opioid receptor
(MOUSE)
BDBM50212613
(CHEMBL266122 | Tyr-Pro-Dmp-Phe-NH2)
Show SMILES Cc1cccc(C)c1C[C@H](NC(=O)[C@@H]1CCCN1C(=O)[C@@H](N)Cc1ccc(O)cc1)C(=O)N[C@@H](Cc1ccccc1)C(N)=O
Show InChI InChI=1S/C34H41N5O5/c1-21-8-6-9-22(2)26(21)20-29(32(42)37-28(31(36)41)19-23-10-4-3-5-11-23)38-33(43)30-12-7-17-39(30)34(44)27(35)18-24-13-15-25(40)16-14-24/h3-6,8-11,13-16,27-30,40H,7,12,17-20,35H2,1-2H3,(H2,36,41)(H,37,42)(H,38,43)/t27-,28-,29-,30-/m0/s1
Reactome pathway
n/an/a 1.39n/an/an/an/an/an/a
Kobe Gakuin University
Curated by ChEMBL
Assay Description
Agonist activity at delta opioid receptor in mouse vas deferens assessed as inhibition of electrically-stimulated muscle contraction
J Med Chem 50: 2753-66 (2007)
Article DOI: 10.1021/jm061238m
BindingDB Entry DOI: 10.7270/Q25B0264
Mu-type opioid receptor
(GUINEA PIG)
BDBM50212613
(CHEMBL266122 | Tyr-Pro-Dmp-Phe-NH2)
Show SMILES Cc1cccc(C)c1C[C@H](NC(=O)[C@@H]1CCCN1C(=O)[C@@H](N)Cc1ccc(O)cc1)C(=O)N[C@@H](Cc1ccccc1)C(N)=O
Show InChI InChI=1S/C34H41N5O5/c1-21-8-6-9-22(2)26(21)20-29(32(42)37-28(31(36)41)19-23-10-4-3-5-11-23)38-33(43)30-12-7-17-39(30)34(44)27(35)18-24-13-15-25(40)16-14-24/h3-6,8-11,13-16,27-30,40H,7,12,17-20,35H2,1-2H3,(H2,36,41)(H,37,42)(H,38,43)/t27-,28-,29-,30-/m0/s1
n/an/a 0.380n/an/an/an/an/an/a
Kobe Gakuin University
Curated by ChEMBL
Assay Description
Agonist activity at mu opioid receptor in Hartley guinea pig ileum assessed as inhibition of electrically-stimulated muscle contraction
J Med Chem 50: 2753-66 (2007)
Article DOI: 10.1021/jm061238m
BindingDB Entry DOI: 10.7270/Q25B0264