BDBM50212616 CHEMBL389949::Dmt-Pro-3,5Dmp-Phe-NH2
SMILES: Cc1cc(C)cc(C[C@H](NC(=O)[C@@H]2CCCN2C(=O)[C@@H](N)Cc2c(C)cc(O)cc2C)C(=O)N[C@@H](Cc2ccccc2)C(N)=O)c1
InChI Key: InChIKey=GBRVPIBAPYVZMY-YDPTYEFTSA-N
Data: 3 KI  2 IC50
Activity Spreadsheet -- Enzyme Inhibition Constant Data from BindingDB
Found 5 hits for monomerid = 50212616
Trg + Lig
Ki
nM
ΔG°
kcal/mole
IC50
nM
Kd
nM
EC50/IC50
nM
koff
s-1
kon
M-1s-1
pHTemp
°C
Mu-type opioid receptor
(Rattus norvegicus (rat))
BDBM50212616
(CHEMBL389949 | Dmt-Pro-3,5Dmp-Phe-NH2)
Show SMILES Cc1cc(C)cc(C[C@H](NC(=O)[C@@H]2CCCN2C(=O)[C@@H](N)Cc2c(C)cc(O)cc2C)C(=O)N[C@@H](Cc2ccccc2)C(N)=O)c1
Show InChI InChI=1S/C36H45N5O5/c1-21-13-22(2)15-26(14-21)19-31(34(44)39-30(33(38)43)18-25-9-6-5-7-10-25)40-35(45)32-11-8-12-41(32)36(46)29(37)20-28-23(3)16-27(42)17-24(28)4/h5-7,9-10,13-17,29-32,42H,8,11-12,18-20,37H2,1-4H3,(H2,38,43)(H,39,44)(H,40,45)/t29-,30-,31-,32-/m0/s1
Reactome pathway
0.110n/an/an/an/an/an/an/an/a
Kobe Gakuin University
Curated by ChEMBL
Assay Description
Displacement of [3H]DAMGO from mu opioid receptor in Sprague-Dawley rat brain P2 synaptosome membrane
J Med Chem 50: 2753-66 (2007)
Article DOI: 10.1021/jm061238m
BindingDB Entry DOI: 10.7270/Q25B0264
Opioid receptors; mu & delta
(Rattus norvegicus (rat))
BDBM50212616
(CHEMBL389949 | Dmt-Pro-3,5Dmp-Phe-NH2)
Show SMILES Cc1cc(C)cc(C[C@H](NC(=O)[C@@H]2CCCN2C(=O)[C@@H](N)Cc2c(C)cc(O)cc2C)C(=O)N[C@@H](Cc2ccccc2)C(N)=O)c1
Show InChI InChI=1S/C36H45N5O5/c1-21-13-22(2)15-26(14-21)19-31(34(44)39-30(33(38)43)18-25-9-6-5-7-10-25)40-35(45)32-11-8-12-41(32)36(46)29(37)20-28-23(3)16-27(42)17-24(28)4/h5-7,9-10,13-17,29-32,42H,8,11-12,18-20,37H2,1-4H3,(H2,38,43)(H,39,44)(H,40,45)/t29-,30-,31-,32-/m0/s1
Reactome pathway
11.6n/an/an/an/an/an/an/an/a
Kobe Gakuin University
Curated by ChEMBL
Assay Description
Displacement of [3H]deltorphin 2 from delta opioid receptor in Sprague-Dawley rat brain P2 synaptosome membrane
J Med Chem 50: 2753-66 (2007)
Article DOI: 10.1021/jm061238m
BindingDB Entry DOI: 10.7270/Q25B0264
Kappa-type opioid receptor
(Cavia porcellus (domestic guinea pig))
BDBM50212616
(CHEMBL389949 | Dmt-Pro-3,5Dmp-Phe-NH2)
Show SMILES Cc1cc(C)cc(C[C@H](NC(=O)[C@@H]2CCCN2C(=O)[C@@H](N)Cc2c(C)cc(O)cc2C)C(=O)N[C@@H](Cc2ccccc2)C(N)=O)c1
Show InChI InChI=1S/C36H45N5O5/c1-21-13-22(2)15-26(14-21)19-31(34(44)39-30(33(38)43)18-25-9-6-5-7-10-25)40-35(45)32-11-8-12-41(32)36(46)29(37)20-28-23(3)16-27(42)17-24(28)4/h5-7,9-10,13-17,29-32,42H,8,11-12,18-20,37H2,1-4H3,(H2,38,43)(H,39,44)(H,40,45)/t29-,30-,31-,32-/m0/s1
830n/an/an/an/an/an/an/an/a
Kobe Gakuin University
Curated by ChEMBL
Assay Description
Displacement of [3H]U69,593 from kappa opioid receptor in Hartley guinea pig cerebellum P2 synaptosome membrane
J Med Chem 50: 2753-66 (2007)
Article DOI: 10.1021/jm061238m
BindingDB Entry DOI: 10.7270/Q25B0264
Mu-type opioid receptor
(GUINEA PIG)
BDBM50212616
(CHEMBL389949 | Dmt-Pro-3,5Dmp-Phe-NH2)
Show SMILES Cc1cc(C)cc(C[C@H](NC(=O)[C@@H]2CCCN2C(=O)[C@@H](N)Cc2c(C)cc(O)cc2C)C(=O)N[C@@H](Cc2ccccc2)C(N)=O)c1
Show InChI InChI=1S/C36H45N5O5/c1-21-13-22(2)15-26(14-21)19-31(34(44)39-30(33(38)43)18-25-9-6-5-7-10-25)40-35(45)32-11-8-12-41(32)36(46)29(37)20-28-23(3)16-27(42)17-24(28)4/h5-7,9-10,13-17,29-32,42H,8,11-12,18-20,37H2,1-4H3,(H2,38,43)(H,39,44)(H,40,45)/t29-,30-,31-,32-/m0/s1
n/an/a 14.4n/an/an/an/an/an/a
Kobe Gakuin University
Curated by ChEMBL
Assay Description
Agonist activity at mu opioid receptor in Hartley guinea pig ileum assessed as inhibition of electrically-stimulated muscle contraction
J Med Chem 50: 2753-66 (2007)
Article DOI: 10.1021/jm061238m
BindingDB Entry DOI: 10.7270/Q25B0264
Delta-type opioid receptor
(MOUSE)
BDBM50212616
(CHEMBL389949 | Dmt-Pro-3,5Dmp-Phe-NH2)
Show SMILES Cc1cc(C)cc(C[C@H](NC(=O)[C@@H]2CCCN2C(=O)[C@@H](N)Cc2c(C)cc(O)cc2C)C(=O)N[C@@H](Cc2ccccc2)C(N)=O)c1
Show InChI InChI=1S/C36H45N5O5/c1-21-13-22(2)15-26(14-21)19-31(34(44)39-30(33(38)43)18-25-9-6-5-7-10-25)40-35(45)32-11-8-12-41(32)36(46)29(37)20-28-23(3)16-27(42)17-24(28)4/h5-7,9-10,13-17,29-32,42H,8,11-12,18-20,37H2,1-4H3,(H2,38,43)(H,39,44)(H,40,45)/t29-,30-,31-,32-/m0/s1
Reactome pathway
n/an/a>1.00E+4n/an/an/an/an/an/a
Kobe Gakuin University
Curated by ChEMBL
Assay Description
Agonist activity at delta opioid receptor in mouse vas deferens assessed as inhibition of electrically-stimulated muscle contraction
J Med Chem 50: 2753-66 (2007)
Article DOI: 10.1021/jm061238m
BindingDB Entry DOI: 10.7270/Q25B0264