BDBM50212635 CHEMBL415266
SMILES: [H][C@]12S[C@@](C)(CSc3nnnn3C)[C@@H](N1C(=O)[C@H]2Br)C(O)=O
InChI Key: InChIKey=GCUVODSDAPCLNV-ASTPYSOASA-N
Data: 10 IC50
Activity Spreadsheet -- Enzyme Inhibition Constant Data from BindingDB
Found 10 hits for monomerid = 50212635
Trg + Lig
Ki
nM
ΔG°
kcal/mole
IC50
nM
Kd
nM
EC50/IC50
nM
koff
s-1
kon
M-1s-1
pHTemp
°C
Beta-lactamase
(Staphylococcus aureus)
BDBM50212635
(CHEMBL415266)
Show SMILES [H][C@]12S[C@@](C)(CSc3nnnn3C)[C@@H](N1C(=O)[C@H]2Br)C(O)=O
Show InChI InChI=1S/C10H12BrN5O3S2/c1-10(3-20-9-12-13-14-15(9)2)5(8(18)19)16-6(17)4(11)7(16)21-10/h4-5,7H,3H2,1-2H3,(H,18,19)/t4-,5+,7-,10+/m1/s1
n/an/a 1.59E+3n/an/an/an/an/an/a
TBA
Assay Description
Inhibitory activity against Staphylococcus aureus CJ8 beta-lactamase enzyme
Citation and Details
BindingDB Entry DOI: 10.7270/Q2ZW1P2T
Class D β-lactamase (OXA-1)
(Escherichia coli (Enterobacteria))
BDBM50212635
(CHEMBL415266)
Show SMILES [H][C@]12S[C@@](C)(CSc3nnnn3C)[C@@H](N1C(=O)[C@H]2Br)C(O)=O
Show InChI InChI=1S/C10H12BrN5O3S2/c1-10(3-20-9-12-13-14-15(9)2)5(8(18)19)16-6(17)4(11)7(16)21-10/h4-5,7H,3H2,1-2H3,(H,18,19)/t4-,5+,7-,10+/m1/s1
n/an/a 8.11E+3n/an/an/an/an/an/a
TBA
Assay Description
Inhibitory activity against Escherichia coli HA209 Class-V OXA-1 type beta-lactamase enzyme
Citation and Details
BindingDB Entry DOI: 10.7270/Q2ZW1P2T
Beta-lactamase type II
(Bacteroides fragilis)
BDBM50212635
(CHEMBL415266)
Show SMILES [H][C@]12S[C@@](C)(CSc3nnnn3C)[C@@H](N1C(=O)[C@H]2Br)C(O)=O
Show InChI InChI=1S/C10H12BrN5O3S2/c1-10(3-20-9-12-13-14-15(9)2)5(8(18)19)16-6(17)4(11)7(16)21-10/h4-5,7H,3H2,1-2H3,(H,18,19)/t4-,5+,7-,10+/m1/s1
NCI pathway
Reactome pathway
n/an/a 40.6n/an/an/an/an/an/a
TBA
Assay Description
Inhibitory activity against Bacteroides fragilis 88854 Class-I beta-lactamase enzyme
Citation and Details
BindingDB Entry DOI: 10.7270/Q2ZW1P2T
Beta-lactamase
(Enterobacter cloacae)
BDBM50212635
(CHEMBL415266)
Show SMILES [H][C@]12S[C@@](C)(CSc3nnnn3C)[C@@H](N1C(=O)[C@H]2Br)C(O)=O
Show InChI InChI=1S/C10H12BrN5O3S2/c1-10(3-20-9-12-13-14-15(9)2)5(8(18)19)16-6(17)4(11)7(16)21-10/h4-5,7H,3H2,1-2H3,(H,18,19)/t4-,5+,7-,10+/m1/s1
n/an/a 2.00E+5n/an/an/an/an/an/a
TBA
Assay Description
Inhibitory activity against Enterobacter cloacae HC8 Class-I beta-lactamase enzyme type P99
Citation and Details
BindingDB Entry DOI: 10.7270/Q2ZW1P2T
Beta-lactamase (TEM-1)
(Escherichia coli)
BDBM50212635
(CHEMBL415266)
Show SMILES [H][C@]12S[C@@](C)(CSc3nnnn3C)[C@@H](N1C(=O)[C@H]2Br)C(O)=O
Show InChI InChI=1S/C10H12BrN5O3S2/c1-10(3-20-9-12-13-14-15(9)2)5(8(18)19)16-6(17)4(11)7(16)21-10/h4-5,7H,3H2,1-2H3,(H,18,19)/t4-,5+,7-,10+/m1/s1
n/an/a 101n/an/an/an/an/an/a
TBA
Assay Description
Inhibitory activity against Escherichia coli HA58R Class-III TEM-1 type beta-lactamase enzyme
Citation and Details
BindingDB Entry DOI: 10.7270/Q2ZW1P2T
Beta-lactamase
(Klebsiella oxytoca)
BDBM50212635
(CHEMBL415266)
Show SMILES [H][C@]12S[C@@](C)(CSc3nnnn3C)[C@@H](N1C(=O)[C@H]2Br)C(O)=O
Show InChI InChI=1S/C10H12BrN5O3S2/c1-10(3-20-9-12-13-14-15(9)2)5(8(18)19)16-6(17)4(11)7(16)21-10/h4-5,7H,3H2,1-2H3,(H,18,19)/t4-,5+,7-,10+/m1/s1
n/an/a 634n/an/an/an/an/an/a
TBA
Assay Description
Inhibitory activity against Klebsiella oxytoca HC7 Class-IV K1 type beta-lactamase enzyme
Citation and Details
BindingDB Entry DOI: 10.7270/Q2ZW1P2T
Beta-lactamase
(Proteus mirabilis)
BDBM50212635
(CHEMBL415266)
Show SMILES [H][C@]12S[C@@](C)(CSc3nnnn3C)[C@@H](N1C(=O)[C@H]2Br)C(O)=O
Show InChI InChI=1S/C10H12BrN5O3S2/c1-10(3-20-9-12-13-14-15(9)2)5(8(18)19)16-6(17)4(11)7(16)21-10/h4-5,7H,3H2,1-2H3,(H,18,19)/t4-,5+,7-,10+/m1/s1
n/an/a 7.61n/an/an/an/an/an/a
TBA
Assay Description
Inhibitory activity against Proteus vulgaris HJ33C Class-I beta-lactamase enzyme
Citation and Details
BindingDB Entry DOI: 10.7270/Q2ZW1P2T
Beta-lactamase
(Citrobacter freundii)
BDBM50212635
(CHEMBL415266)
Show SMILES [H][C@]12S[C@@](C)(CSc3nnnn3C)[C@@H](N1C(=O)[C@H]2Br)C(O)=O
Show InChI InChI=1S/C10H12BrN5O3S2/c1-10(3-20-9-12-13-14-15(9)2)5(8(18)19)16-6(17)4(11)7(16)21-10/h4-5,7H,3H2,1-2H3,(H,18,19)/t4-,5+,7-,10+/m1/s1
n/an/a 1.01E+5n/an/an/an/an/an/a
TBA
Assay Description
Inhibitory activity against Citrobacter freundii 87470 Class-I beta-lactamase enzyme
Citation and Details
BindingDB Entry DOI: 10.7270/Q2ZW1P2T
SHV-1 beta-lactamase
(Klebsiella pneumoniae (Enterobacteria))
BDBM50212635
(CHEMBL415266)
Show SMILES [H][C@]12S[C@@](C)(CSc3nnnn3C)[C@@H](N1C(=O)[C@H]2Br)C(O)=O
Show InChI InChI=1S/C10H12BrN5O3S2/c1-10(3-20-9-12-13-14-15(9)2)5(8(18)19)16-6(17)4(11)7(16)21-10/h4-5,7H,3H2,1-2H3,(H,18,19)/t4-,5+,7-,10+/m1/s1
n/an/a 1.01E+3n/an/an/an/an/an/a
TBA
Assay Description
Inhibitory activity against Escherichia coli HA208 Class-III SHV-1 type beta-lactamase enzyme
Citation and Details
BindingDB Entry DOI: 10.7270/Q2ZW1P2T
Beta-lactamase BRO-1
(Moraxella catarrhalis)
BDBM50212635
(CHEMBL415266)
Show SMILES [H][C@]12S[C@@](C)(CSc3nnnn3C)[C@@H](N1C(=O)[C@H]2Br)C(O)=O
Show InChI InChI=1S/C10H12BrN5O3S2/c1-10(3-20-9-12-13-14-15(9)2)5(8(18)19)16-6(17)4(11)7(16)21-10/h4-5,7H,3H2,1-2H3,(H,18,19)/t4-,5+,7-,10+/m1/s1
n/an/a 50.7n/an/an/an/an/an/a
TBA
Assay Description
Inhibitory activity against Branhamella catarrhalis 89001 Class-III BRO-1 type beta-lactamase enzyme
Citation and Details
BindingDB Entry DOI: 10.7270/Q2ZW1P2T