null
SMILES: FC(F)(F)Oc1ccc(cc1Cl)C1=NC(CN1)c1cccc(Cl)c1
InChI Key: InChIKey=YSVGUVAAWFHBTN-UHFFFAOYSA-N
Activity Spreadsheet -- Enzyme Inhibition Constant Data from BindingDB
Found 2 hits for monomerid = 50212681
Trg + Lig
Ki
nM
ΔG°
kcal/mole
IC50
nM
Kd
nM
EC50/IC50
nM
koff
s-1
kon
M-1s-1
pHTemp
°C
Glutamate receptor ionotropic, NMDA 2B
(Homo sapiens (Human))
BDBM50212681
(2-(3-chloro-4-(trifluoromethoxy)phenyl)-5-(3-chlor...)
Show SMILES FC(F)(F)Oc1ccc(cc1Cl)C1=NC(CN1)c1cccc(Cl)c1 |t:13|
Show InChI InChI=1S/C16H11Cl2F3N2O/c17-11-3-1-2-9(6-11)13-8-22-15(23-13)10-4-5-14(12(18)7-10)24-16(19,20)21/h1-7,13H,8H2,(H,22,23)
NCI pathway
Reactome pathway
66n/an/an/an/an/an/an/an/a
Merck Research Laboratories
Curated by ChEMBL
Assay Description
Binding affinity to NMDA NR2B receptor
Bioorg Med Chem Lett 17: 3997-4000 (2007)
Article DOI: 10.1016/j.bmcl.2007.04.084
BindingDB Entry DOI: 10.7270/Q21J99GV
Glutamate receptor ionotropic, NMDA 2B
(Homo sapiens (Human))
BDBM50212681
(2-(3-chloro-4-(trifluoromethoxy)phenyl)-5-(3-chlor...)
Show SMILES FC(F)(F)Oc1ccc(cc1Cl)C1=NC(CN1)c1cccc(Cl)c1 |t:13|
Show InChI InChI=1S/C16H11Cl2F3N2O/c17-11-3-1-2-9(6-11)13-8-22-15(23-13)10-4-5-14(12(18)7-10)24-16(19,20)21/h1-7,13H,8H2,(H,22,23)
NCI pathway
Reactome pathway
n/an/a 266n/an/an/an/an/an/a
Merck Research Laboratories
Curated by ChEMBL
Assay Description
Antagonist activity at NMDA NR2B receptor assessed as calcium flux
Bioorg Med Chem Lett 17: 3997-4000 (2007)
Article DOI: 10.1016/j.bmcl.2007.04.084
BindingDB Entry DOI: 10.7270/Q21J99GV