BDBM50212693 2-(4-(4-(4-(trifluoromethyl)benzyloxy)benzylthio)-5-methoxy-2-methylphenoxy)acetic acid::CHEMBL234659
SMILES: COc1cc(OCC(O)=O)c(C)cc1SCc1ccc(OCc2ccc(cc2)C(F)(F)F)cc1
InChI Key: InChIKey=ONKOHQZZVMTPOM-UHFFFAOYSA-N
Data: 9 IC50  1 EC50
Activity Spreadsheet -- Enzyme Inhibition Constant Data from BindingDB
Found 10 hits for monomerid = 50212693
Trg + Lig
Ki
nM
ΔG°
kcal/mole
IC50
nM
Kd
nM
EC50/IC50
nM
koff
s-1
kon
M-1s-1
pHTemp
°C
Peroxisome proliferator-activated receptor delta
(Homo sapiens (Human))
BDBM50212693
(2-(4-(4-(4-(trifluoromethyl)benzyloxy)benzylthio)-...)
Show SMILES COc1cc(OCC(O)=O)c(C)cc1SCc1ccc(OCc2ccc(cc2)C(F)(F)F)cc1
Show InChI InChI=1S/C25H23F3O5S/c1-16-11-23(22(31-2)12-21(16)33-14-24(29)30)34-15-18-5-9-20(10-6-18)32-13-17-3-7-19(8-4-17)25(26,27)28/h3-12H,13-15H2,1-2H3,(H,29,30)
n/an/an/an/a 13n/an/an/an/a
Pfizer Global Research and Development
Curated by ChEMBL
Assay Description
Agonist activity at human PPARdelta expressed in HepG2 cells after 16 hrs by luciferase reporter gene assay
Bioorg Med Chem Lett 17: 3624-9 (2007)
Article DOI: 10.1016/j.bmcl.2007.04.046
BindingDB Entry DOI: 10.7270/Q2S1826N
Peroxisome proliferator-activated receptor
(Homo sapiens (Human))
BDBM50212693
(2-(4-(4-(4-(trifluoromethyl)benzyloxy)benzylthio)-...)
Show SMILES COc1cc(OCC(O)=O)c(C)cc1SCc1ccc(OCc2ccc(cc2)C(F)(F)F)cc1
Show InChI InChI=1S/C25H23F3O5S/c1-16-11-23(22(31-2)12-21(16)33-14-24(29)30)34-15-18-5-9-20(10-6-18)32-13-17-3-7-19(8-4-17)25(26,27)28/h3-12H,13-15H2,1-2H3,(H,29,30)
NCI pathway
Reactome pathway
n/an/a 2.36E+4n/an/an/an/an/an/a
Pfizer Global Research and Development
Curated by ChEMBL
Assay Description
Displacement of [3H]5-(4-(3-(5-methyl-2-phenyloxazol-4-yl)propanoyl)benzyl)thiazolidine-2,4-dione from human PPARgamma after 2 hrs by SPA assay
Bioorg Med Chem Lett 17: 3624-9 (2007)
Article DOI: 10.1016/j.bmcl.2007.04.046
BindingDB Entry DOI: 10.7270/Q2S1826N
Peroxisome proliferator-activated receptor alpha (PPAR alpha)
(Homo sapiens (Human))
BDBM50212693
(2-(4-(4-(4-(trifluoromethyl)benzyloxy)benzylthio)-...)
Show SMILES COc1cc(OCC(O)=O)c(C)cc1SCc1ccc(OCc2ccc(cc2)C(F)(F)F)cc1
Show InChI InChI=1S/C25H23F3O5S/c1-16-11-23(22(31-2)12-21(16)33-14-24(29)30)34-15-18-5-9-20(10-6-18)32-13-17-3-7-19(8-4-17)25(26,27)28/h3-12H,13-15H2,1-2H3,(H,29,30)
n/an/a 4.70n/an/an/an/an/an/a
Pfizer Global Research and Development
Curated by ChEMBL
Assay Description
Displacement of [3H]2-(4-(2-(3-(2,4-difluorophenyl)-1-heptylureido)ethyl)phenoxy)-2-methylbutanoic acid from human PPARalpha after 30 mins by SPA ass...
Bioorg Med Chem Lett 17: 3624-9 (2007)
Article DOI: 10.1016/j.bmcl.2007.04.046
BindingDB Entry DOI: 10.7270/Q2S1826N
Peroxisome proliferator-activated receptor delta
(Homo sapiens (Human))
BDBM50212693
(2-(4-(4-(4-(trifluoromethyl)benzyloxy)benzylthio)-...)
Show SMILES COc1cc(OCC(O)=O)c(C)cc1SCc1ccc(OCc2ccc(cc2)C(F)(F)F)cc1
Show InChI InChI=1S/C25H23F3O5S/c1-16-11-23(22(31-2)12-21(16)33-14-24(29)30)34-15-18-5-9-20(10-6-18)32-13-17-3-7-19(8-4-17)25(26,27)28/h3-12H,13-15H2,1-2H3,(H,29,30)
n/an/a 1.70n/an/an/an/an/an/a
Pfizer Global Research and Development
Curated by ChEMBL
Assay Description
Displacement of [3H]2-(4-(3-(4-acetyl-3-hydroxy-2 propyl-phenoxy)propoxy)phenoxy)acetic acid from human PPARdelta after 30 mins by SPA assay
Bioorg Med Chem Lett 17: 3624-9 (2007)
Article DOI: 10.1016/j.bmcl.2007.04.046
BindingDB Entry DOI: 10.7270/Q2S1826N
Peroxisome proliferator-activated receptor delta
(Homo sapiens (Human))
BDBM50212693
(2-(4-(4-(4-(trifluoromethyl)benzyloxy)benzylthio)-...)
Show SMILES COc1cc(OCC(O)=O)c(C)cc1SCc1ccc(OCc2ccc(cc2)C(F)(F)F)cc1
Show InChI InChI=1S/C25H23F3O5S/c1-16-11-23(22(31-2)12-21(16)33-14-24(29)30)34-15-18-5-9-20(10-6-18)32-13-17-3-7-19(8-4-17)25(26,27)28/h3-12H,13-15H2,1-2H3,(H,29,30)
n/an/a 1.70n/an/an/an/an/an/a
Universidad Nacional Aut£noma de M£xico
Curated by ChEMBL
Assay Description
Agonist activity at PPARdelta
Bioorg Med Chem 20: 3523-32 (2012)
Article DOI: 10.1016/j.bmc.2012.04.005
BindingDB Entry DOI: 10.7270/Q2MP54B4
Peroxisome proliferator-activated receptor
(Homo sapiens (Human))
BDBM50212693
(2-(4-(4-(4-(trifluoromethyl)benzyloxy)benzylthio)-...)
Show SMILES COc1cc(OCC(O)=O)c(C)cc1SCc1ccc(OCc2ccc(cc2)C(F)(F)F)cc1
Show InChI InChI=1S/C25H23F3O5S/c1-16-11-23(22(31-2)12-21(16)33-14-24(29)30)34-15-18-5-9-20(10-6-18)32-13-17-3-7-19(8-4-17)25(26,27)28/h3-12H,13-15H2,1-2H3,(H,29,30)
NCI pathway
Reactome pathway
n/an/a 2.36E+4n/an/an/an/an/an/a
Universidad Nacional Aut£noma de M£xico
Curated by ChEMBL
Assay Description
Agonist activity at PPARgamma
Bioorg Med Chem 20: 3523-32 (2012)
Article DOI: 10.1016/j.bmc.2012.04.005
BindingDB Entry DOI: 10.7270/Q2MP54B4
Peroxisome proliferator-activated receptor alpha (PPAR alpha)
(Homo sapiens (Human))
BDBM50212693
(2-(4-(4-(4-(trifluoromethyl)benzyloxy)benzylthio)-...)
Show SMILES COc1cc(OCC(O)=O)c(C)cc1SCc1ccc(OCc2ccc(cc2)C(F)(F)F)cc1
Show InChI InChI=1S/C25H23F3O5S/c1-16-11-23(22(31-2)12-21(16)33-14-24(29)30)34-15-18-5-9-20(10-6-18)32-13-17-3-7-19(8-4-17)25(26,27)28/h3-12H,13-15H2,1-2H3,(H,29,30)
n/an/a 4.70n/an/an/an/an/an/a
Universidad Nacional Aut£noma de M£xico
Curated by ChEMBL
Assay Description
Agonist activity at PPARalpha
Bioorg Med Chem 20: 3523-32 (2012)
Article DOI: 10.1016/j.bmc.2012.04.005
BindingDB Entry DOI: 10.7270/Q2MP54B4
Peroxisome proliferator-activated receptor delta
(Homo sapiens (Human))
BDBM50212693
(2-(4-(4-(4-(trifluoromethyl)benzyloxy)benzylthio)-...)
Show SMILES COc1cc(OCC(O)=O)c(C)cc1SCc1ccc(OCc2ccc(cc2)C(F)(F)F)cc1
Show InChI InChI=1S/C25H23F3O5S/c1-16-11-23(22(31-2)12-21(16)33-14-24(29)30)34-15-18-5-9-20(10-6-18)32-13-17-3-7-19(8-4-17)25(26,27)28/h3-12H,13-15H2,1-2H3,(H,29,30)
n/an/a 1.70n/an/an/an/an/an/a
Universidad Nacional Aut£noma de M£xico
Curated by ChEMBL
Assay Description
Agonist activity at PPARdelta
Bioorg Med Chem 20: 3523-32 (2012)
Article DOI: 10.1016/j.bmc.2012.04.005
BindingDB Entry DOI: 10.7270/Q2MP54B4
Peroxisome proliferator-activated receptor
(Homo sapiens (Human))
BDBM50212693
(2-(4-(4-(4-(trifluoromethyl)benzyloxy)benzylthio)-...)
Show SMILES COc1cc(OCC(O)=O)c(C)cc1SCc1ccc(OCc2ccc(cc2)C(F)(F)F)cc1
Show InChI InChI=1S/C25H23F3O5S/c1-16-11-23(22(31-2)12-21(16)33-14-24(29)30)34-15-18-5-9-20(10-6-18)32-13-17-3-7-19(8-4-17)25(26,27)28/h3-12H,13-15H2,1-2H3,(H,29,30)
NCI pathway
Reactome pathway
n/an/a 2.36E+4n/an/an/an/an/an/a
Universidad Nacional Aut£noma de M£xico
Curated by ChEMBL
Assay Description
Agonist activity at PPARgamma
Bioorg Med Chem 20: 3523-32 (2012)
Article DOI: 10.1016/j.bmc.2012.04.005
BindingDB Entry DOI: 10.7270/Q2MP54B4
Peroxisome proliferator-activated receptor alpha (PPAR alpha)
(Homo sapiens (Human))
BDBM50212693
(2-(4-(4-(4-(trifluoromethyl)benzyloxy)benzylthio)-...)
Show SMILES COc1cc(OCC(O)=O)c(C)cc1SCc1ccc(OCc2ccc(cc2)C(F)(F)F)cc1
Show InChI InChI=1S/C25H23F3O5S/c1-16-11-23(22(31-2)12-21(16)33-14-24(29)30)34-15-18-5-9-20(10-6-18)32-13-17-3-7-19(8-4-17)25(26,27)28/h3-12H,13-15H2,1-2H3,(H,29,30)
n/an/a 4.70n/an/an/an/an/an/a
Universidad Nacional Aut£noma de M£xico
Curated by ChEMBL
Assay Description
Agonist activity at PPARalpha
Bioorg Med Chem 20: 3523-32 (2012)
Article DOI: 10.1016/j.bmc.2012.04.005
BindingDB Entry DOI: 10.7270/Q2MP54B4