BDBM50213060 CHEMBL355401::SC-50135
SMILES: CCCc1c(OCCCOc2ccc3CCC(Oc3c2CCC)C(O)=O)ccc(C(=O)N2CCCC2)c1OC
InChI Key: InChIKey=POSHDLOOHKRLEK-UHFFFAOYSA-N
Data: 1 IC50
Activity Spreadsheet -- Enzyme Inhibition Constant Data from BindingDB
Found 1 hit for monomerid = 50213060
Trg + Lig
Ki
nM
ΔG°
kcal/mole
IC50
nM
Kd
nM
EC50/IC50
nM
koff
s-1
kon
M-1s-1
pHTemp
°C
Leukotriene B4 receptor
(Homo sapiens (Human))
BDBM50213060
(CHEMBL355401 | SC-50135)
Show SMILES CCCc1c(OCCCOc2ccc3CCC(Oc3c2CCC)C(O)=O)ccc(C(=O)N2CCCC2)c1OC
Show InChI InChI=1S/C31H41NO7/c1-4-9-22-25(14-11-21-12-15-27(31(34)35)39-28(21)22)37-19-8-20-38-26-16-13-24(29(36-3)23(26)10-5-2)30(33)32-17-6-7-18-32/h11,13-14,16,27H,4-10,12,15,17-20H2,1-3H3,(H,34,35)
n/an/a<0.100n/an/an/an/an/an/a
TBA
Curated by ChEMBL
Assay Description
Inhibitory activity against leukotriene B4 receptor
Bioorg Med Chem Lett 4: 811-816 (1994)
Article DOI: 10.1016/S0960-894X(01)80853-2
BindingDB Entry DOI: 10.7270/Q2DN451X