null
SMILES: [Na+].[H][C@]12[C@@H](C)C(Sc3nc4ccc(Cl)cc4s3)=C(N1C(=O)[C@]2([H])[C@@H](C)O)C([O-])=O
InChI Key: InChIKey=QZMLRBNLMQXGRX-XWTBWJTNSA-M
Activity Spreadsheet -- Enzyme Inhibition Constant Data from BindingDB
Found 1 hit for monomerid = 50213222
Trg + Lig
Ki
nM
ΔG°
kcal/mole
IC50
nM
Kd
nM
EC50/IC50
nM
koff
s-1
kon
M-1s-1
pHTemp
°C
PBP2A
(Staphylococcus aureus)
BDBM50213222
(CHEMBL33794)
Show SMILES [Na+].[H][C@]12[C@@H](C)C(Sc3nc4ccc(Cl)cc4s3)=C(N1C(=O)[C@]2([H])[C@@H](C)O)C([O-])=O |c:17|
Show InChI InChI=1S/C17H15ClN2O4S2/c1-6-12-11(7(2)21)15(22)20(12)13(16(23)24)14(6)26-17-19-9-4-3-8(18)5-10(9)25-17/h3-7,11-12,21H,1-2H3,(H,23,24)/p-1/t6-,7-,11-,12-/m1/s1
n/an/a 2.08E+3n/an/an/an/an/an/a
TBA
Assay Description
Binding affinity towards Penicillin-binding protein 2a from homogeneous MRSA COL strain using [3H]-radioligand
Citation and Details
BindingDB Entry DOI: 10.7270/Q26975R5