BDBM50213347 CHEMBL70676
SMILES: Ic1c(NC2=NCCN2)ccc2nccnc12
InChI Key: InChIKey=YYTGOWDNUUXBGS-UHFFFAOYSA-N
Data: 1 KI  1 EC50
Activity Spreadsheet -- Enzyme Inhibition Constant Data from BindingDB
Found 2 hits for monomerid = 50213347
Trg + Lig
Ki
nM
ΔG°
kcal/mole
IC50
nM
Kd
nM
EC50/IC50
nM
koff
s-1
kon
M-1s-1
pHTemp
°C
Alpha-1B adrenergic receptor
(Homo sapiens (Human))
BDBM50213347
(CHEMBL70676)
Show SMILES Ic1c(NC2=NCCN2)ccc2nccnc12 |t:4|
Show InChI InChI=1S/C11H10IN5/c12-9-7(17-11-15-5-6-16-11)1-2-8-10(9)14-4-3-13-8/h1-4H,5-6H2,(H2,15,16,17)
1.91E+3n/an/an/an/an/an/an/an/a
TBA
Assay Description
Binding affinity for human Alpha-1B adrenergic receptor from cultured LM(tk-) cells using [3H]prazosin
Citation and Details
BindingDB Entry DOI: 10.7270/Q2DV1N3J
Alpha-2A adrenergic receptor
(Homo sapiens (Human))
BDBM50213347
(CHEMBL70676)
Show SMILES Ic1c(NC2=NCCN2)ccc2nccnc12 |t:4|
Show InChI InChI=1S/C11H10IN5/c12-9-7(17-11-15-5-6-16-11)1-2-8-10(9)14-4-3-13-8/h1-4H,5-6H2,(H2,15,16,17)
n/an/an/an/a 11n/an/an/an/a
TBA
Assay Description
Alpha-2A adrenergic receptor agonistic potency as inhibition of forskolin-stimulated synthesis of cyclic adenosine monophosphate
Citation and Details
BindingDB Entry DOI: 10.7270/Q2DV1N3J