BDBM50213493 2-(2'-methoxy-4'-hydroxyphenyl)-5-(3-methylbut-2-enyl)-6-hydroxybenzofuran::CHEMBL232941
SMILES: [#6]-[#8]-c1cc(-[#8])ccc1-c1cc2cc(-[#6]\[#6]=[#6](/[#6])-[#6])c(-[#8])cc2o1
InChI Key: InChIKey=QZVJJJNZJBVWPG-UHFFFAOYSA-N
Data: 1 IC50
Activity Spreadsheet -- Enzyme Inhibition Constant Data from BindingDB
Found 1 hit for monomerid = 50213493
Trg + Lig
Ki
nM
ΔG°
kcal/mole
IC50
nM
Kd
nM
EC50/IC50
nM
koff
s-1
kon
M-1s-1
pHTemp
°C
Protein-tyrosine phosphatase 1B
(Homo sapiens (Human))
BDBM50213493
(2-(2'-methoxy-4'-hydroxyphenyl)-5-(3-methylbut-2-e...)
Show SMILES [#6]-[#8]-c1cc(-[#8])ccc1-c1cc2cc(-[#6]\[#6]=[#6](/[#6])-[#6])c(-[#8])cc2o1
Show InChI InChI=1S/C20H20O4/c1-12(2)4-5-13-8-14-9-20(24-18(14)11-17(13)22)16-7-6-15(21)10-19(16)23-3/h4,6-11,21-22H,5H2,1-3H3
NCI pathway
Reactome pathway
n/an/a 1.57E+4n/an/an/an/an/an/a
Korea Research Institute of Bioscience and Biotechnology
Curated by ChEMBL
Assay Description
Inhibition of PTP1B
Bioorg Med Chem Lett 17: 3868-71 (2007)
Article DOI: 10.1016/j.bmcl.2007.05.005
BindingDB Entry DOI: 10.7270/Q29W0F6F