BDBM50213729 (R)-2-amino-3-(methylthio)propanoic acid::CHEMBL394875::S-METHYLCYSTEINE
SMILES: CSC[C@H](N)C(O)=O
InChI Key: InChIKey=IDIDJDIHTAOVLG-VKHMYHEASA-N
Data: 1 IC50
Activity Spreadsheet -- Enzyme Inhibition Constant Data from BindingDB
Found 1 hit for monomerid = 50213729
Trg + Lig
Ki
nM
ΔG°
kcal/mole
IC50
nM
Kd
nM
EC50/IC50
nM
koff
s-1
kon
M-1s-1
pHTemp
°C
Kinesin-like protein KIF11
(Homo sapiens (Human))
BDBM50213729
((R)-2-amino-3-(methylthio)propanoic acid | CHEMBL3...)
Show SMILES CSC[C@H](N)C(O)=O
Show InChI InChI=1S/C4H9NO2S/c1-8-2-3(5)4(6)7/h3H,2,5H2,1H3,(H,6,7)/t3-/m0/s1
Reactome pathway
n/an/a>6.30E+4n/an/an/an/an/an/a
University of Shizuoka
Curated by ChEMBL
Assay Description
Inhibition of Eg5 assessed as inhibition ATP hydrolysis by ATPase assay
Bioorg Med Chem Lett 17: 3921-4 (2007)
Article DOI: 10.1016/j.bmcl.2007.04.101
BindingDB Entry DOI: 10.7270/Q2542N8R