BDBM50213738 3-(2-chloro-phenylamino)-1,1-dioxo-1,4-dihydro-1lambda6-benzo[1,2,4]thiadiazin-5-ol::CHEMBL234177
SMILES: Oc1cccc2c1N=C(Nc1ccccc1Cl)NS2(=O)=O
InChI Key: InChIKey=OPHVRMBDDUQBHY-UHFFFAOYSA-N
Data: 1 IC50
Activity Spreadsheet -- Enzyme Inhibition Constant Data from BindingDB
Found 1 hit for monomerid = 50213738
Trg + Lig
Ki
nM
ΔG°
kcal/mole
IC50
nM
Kd
nM
EC50/IC50
nM
koff
s-1
kon
M-1s-1
pHTemp
°C
C-X-C chemokine receptor type 2
(Homo sapiens (Human))
BDBM50213738
(3-(2-chloro-phenylamino)-1,1-dioxo-1,4-dihydro-1la...)
Show SMILES Oc1cccc2c1N=C(Nc1ccccc1Cl)NS2(=O)=O |t:8|
Show InChI InChI=1S/C13H10ClN3O3S/c14-8-4-1-2-5-9(8)15-13-16-12-10(18)6-3-7-11(12)21(19,20)17-13/h1-7,18H,(H2,15,16,17)
Reactome pathway
n/an/a 5.20E+3n/an/an/an/an/an/a
GlaxoSmithKline
Curated by ChEMBL
Assay Description
Antagonist activity at CXCR2 receptor expressed in CHOK1 cells assessed as human IL8-induced calcium mobilization by FLIPR
Bioorg Med Chem Lett 17: 3864-7 (2007)
Article DOI: 10.1016/j.bmcl.2007.05.011
BindingDB Entry DOI: 10.7270/Q21C1WKG