BDBM50213741 3-(2-bromo-phenylamino)-7-chloro-1,1-dioxo-1,4-dihydro-1lambda6-benzo[1,2,4]thiadiazin-5-ol::CHEMBL393047
SMILES: Oc1cc(Cl)cc2c1N=C(Nc1ccccc1Br)NS2(=O)=O
InChI Key: InChIKey=GPAMUYHZZSXOLG-UHFFFAOYSA-N
Data: 3 IC50
Activity Spreadsheet -- Enzyme Inhibition Constant Data from BindingDB
Found 3 hits for monomerid = 50213741
Trg + Lig
Ki
nM
ΔG°
kcal/mole
IC50
nM
Kd
nM
EC50/IC50
nM
koff
s-1
kon
M-1s-1
pHTemp
°C
C-X-C chemokine receptor type 2
(Homo sapiens (Human))
BDBM50213741
(3-(2-bromo-phenylamino)-7-chloro-1,1-dioxo-1,4-dih...)
Show SMILES Oc1cc(Cl)cc2c1N=C(Nc1ccccc1Br)NS2(=O)=O |t:9|
Show InChI InChI=1S/C13H9BrClN3O3S/c14-8-3-1-2-4-9(8)16-13-17-12-10(19)5-7(15)6-11(12)22(20,21)18-13/h1-6,19H,(H2,16,17,18)
Reactome pathway
n/an/a 400n/an/an/an/an/an/a
GlaxoSmithKline
Curated by ChEMBL
Assay Description
Antagonist activity at CXCR2 receptor expressed in CHOK1 cells assessed as human IL8-induced calcium mobilization by FLIPR
Bioorg Med Chem Lett 17: 3864-7 (2007)
Article DOI: 10.1016/j.bmcl.2007.05.011
BindingDB Entry DOI: 10.7270/Q21C1WKG
C-X-C chemokine receptor type 2
(Homo sapiens (Human))
BDBM50213741
(3-(2-bromo-phenylamino)-7-chloro-1,1-dioxo-1,4-dih...)
Show SMILES Oc1cc(Cl)cc2c1N=C(Nc1ccccc1Br)NS2(=O)=O |t:9|
Show InChI InChI=1S/C13H9BrClN3O3S/c14-8-3-1-2-4-9(8)16-13-17-12-10(19)5-7(15)6-11(12)22(20,21)18-13/h1-6,19H,(H2,16,17,18)
Reactome pathway
n/an/a 64n/an/an/an/an/an/a
GlaxoSmithKline
Curated by ChEMBL
Assay Description
Antagonist activity at CXCR2 receptor expressed in CHOK1 cells assessed as human IL8-induced calcium mobilization by FLIPR
Bioorg Med Chem Lett 17: 3864-7 (2007)
Article DOI: 10.1016/j.bmcl.2007.05.011
BindingDB Entry DOI: 10.7270/Q21C1WKG
C-X-C chemokine receptor type 1
(Homo sapiens (Human))
BDBM50213741
(3-(2-bromo-phenylamino)-7-chloro-1,1-dioxo-1,4-dih...)
Show SMILES Oc1cc(Cl)cc2c1N=C(Nc1ccccc1Br)NS2(=O)=O |t:9|
Show InChI InChI=1S/C13H9BrClN3O3S/c14-8-3-1-2-4-9(8)16-13-17-12-10(19)5-7(15)6-11(12)22(20,21)18-13/h1-6,19H,(H2,16,17,18)
n/an/a 1.30E+4n/an/an/an/an/an/a
GlaxoSmithKline
Curated by ChEMBL
Assay Description
Displacement of human recombinant [125I]IL8 from CXCR1 receptor expressed in CHO cells
Bioorg Med Chem Lett 17: 3864-7 (2007)
Article DOI: 10.1016/j.bmcl.2007.05.011
BindingDB Entry DOI: 10.7270/Q21C1WKG