null
SMILES: Cc1cc(cc(C)n1)-c1c(F)cc2c(c1F)n(cc(Cc1ccccc1N)c2=O)C1CC1
InChI Key: InChIKey=PORMMXYUPVOUTC-UHFFFAOYSA-N
Activity Spreadsheet -- Enzyme Inhibition Constant Data from BindingDB
Found 1 hit for monomerid = 50213811
Trg + Lig
Ki
nM
ΔG°
kcal/mole
IC50
nM
Kd
nM
EC50/IC50
nM
koff
s-1
kon
M-1s-1
pHTemp
°C
DNA topoisomerase 2-alpha/2-beta
(Homo sapiens (Human))
BDBM50213811
(CHEMBL7769)
Show SMILES Cc1cc(cc(C)n1)-c1c(F)cc2c(c1F)n(cc(Cc1ccccc1N)c2=O)C1CC1
Show InChI InChI=1S/C26H23F2N3O/c1-14-9-17(10-15(2)30-14)23-21(27)12-20-25(24(23)28)31(19-7-8-19)13-18(26(20)32)11-16-5-3-4-6-22(16)29/h3-6,9-10,12-13,19H,7-8,11,29H2,1-2H3
n/an/an/an/a 2.10E+3n/an/an/an/a
TBA
Assay Description
Inhibitory activity against HeLa cell Topoisomerase II
Citation and Details
BindingDB Entry DOI: 10.7270/Q2TX3HJW