null
SMILES: Nc1c(NC\C=C/COc2csc(CN3CCCCC3)c2)c(=O)c1=O
InChI Key: InChIKey=ZXLCEKMBIFPOSF-DJWKRKHSSA-N
Activity Spreadsheet -- Enzyme Inhibition Constant Data from BindingDB
Found 1 hit for monomerid = 50213876
Trg + Lig
Ki
nM
ΔG°
kcal/mole
IC50
nM
Kd
nM
EC50/IC50
nM
koff
s-1
kon
M-1s-1
pHTemp
°C
Histamine H2 receptor
(Cavia porcellus (domestic guinea pig))
BDBM50213876
(CHEMBL50524)
Show SMILES Nc1c(NC\C=C/COc2csc(CN3CCCCC3)c2)c(=O)c1=O
Show InChI InChI=1S/C18H23N3O3S/c19-15-16(18(23)17(15)22)20-6-2-5-9-24-13-10-14(25-12-13)11-21-7-3-1-4-8-21/h2,5,10,12,20H,1,3-4,6-9,11,19H2/b5-2-
n/an/a 442n/an/an/an/an/an/a
TBA
Assay Description
Histamine H2 receptor antagonistic activity
Citation and Details
BindingDB Entry DOI: 10.7270/Q2XP773S