BDBM50213878 CHEMBL301294
SMILES: CN(C)Cc1cc(OC\C=C/CN=c2c(O)c(O)c2=N)cs1
InChI Key: InChIKey=ILJQTXOXHFCQGW-NTVQUMIESA-N
Data: 1 IC50
Activity Spreadsheet -- Enzyme Inhibition Constant Data from BindingDB
Found 1 hit for monomerid = 50213878
Trg + Lig
Ki
nM
ΔG°
kcal/mole
IC50
nM
Kd
nM
EC50/IC50
nM
koff
s-1
kon
M-1s-1
pHTemp
°C
Histamine H2 receptor
(Cavia porcellus (domestic guinea pig))
BDBM50213878
(CHEMBL301294)
Show SMILES CN(C)Cc1cc(OC\C=C/CN=c2c(O)c(O)c2=N)cs1
Show InChI InChI=1S/C15H19N3O3S/c1-18(2)8-11-7-10(9-22-11)21-6-4-3-5-17-13-12(16)14(19)15(13)20/h3-4,7,9,16,19-20H,5-6,8H2,1-2H3/b4-3-,16-12?,17-13-
n/an/a 0.220n/an/an/an/an/an/a
TBA
Assay Description
Histamine H2 receptor antagonistic activity
Citation and Details
BindingDB Entry DOI: 10.7270/Q2XP773S