BDBM50214200 2-(4-butoxy-3-((2-fluoro-4-(trifluoromethyl)benzamido)methyl)benzyl)pentanoic acid::CHEMBL229573
SMILES: CCCCOc1ccc(CC(CCC)C(O)=O)cc1CNC(=O)c1ccc(cc1F)C(F)(F)F
InChI Key: InChIKey=YFOSSOSPJLEQRP-UHFFFAOYSA-N
Data: 3 EC50
Activity Spreadsheet -- Enzyme Inhibition Constant Data from BindingDB
Found 3 hits for monomerid = 50214200
Trg + Lig
Ki
nM
ΔG°
kcal/mole
IC50
nM
Kd
nM
EC50/IC50
nM
koff
s-1
kon
M-1s-1
pHTemp
°C
Peroxisome proliferator-activated receptor delta
(Homo sapiens (Human))
BDBM50214200
(2-(4-butoxy-3-((2-fluoro-4-(trifluoromethyl)benzam...)
Show SMILES CCCCOc1ccc(CC(CCC)C(O)=O)cc1CNC(=O)c1ccc(cc1F)C(F)(F)F |w:10.9|
Show InChI InChI=1S/C25H29F4NO4/c1-3-5-11-34-22-10-7-16(12-17(6-4-2)24(32)33)13-18(22)15-30-23(31)20-9-8-19(14-21(20)26)25(27,28)29/h7-10,13-14,17H,3-6,11-12,15H2,1-2H3,(H,30,31)(H,32,33)
n/an/an/an/a 5.10n/an/an/an/a
University of Tokyo
Curated by ChEMBL
Assay Description
Effect on PPARdelta transactivation activity in HEK293 cells
Bioorg Med Chem 15: 5177-90 (2007)
Article DOI: 10.1016/j.bmc.2007.05.023
BindingDB Entry DOI: 10.7270/Q2QZ29P7
Peroxisome proliferator-activated receptor
(Homo sapiens (Human))
BDBM50214200
(2-(4-butoxy-3-((2-fluoro-4-(trifluoromethyl)benzam...)
Show SMILES CCCCOc1ccc(CC(CCC)C(O)=O)cc1CNC(=O)c1ccc(cc1F)C(F)(F)F |w:10.9|
Show InChI InChI=1S/C25H29F4NO4/c1-3-5-11-34-22-10-7-16(12-17(6-4-2)24(32)33)13-18(22)15-30-23(31)20-9-8-19(14-21(20)26)25(27,28)29/h7-10,13-14,17H,3-6,11-12,15H2,1-2H3,(H,30,31)(H,32,33)
NCI pathway
Reactome pathway
n/an/an/an/a 1.00E+3n/an/an/an/a
University of Tokyo
Curated by ChEMBL
Assay Description
Effect on PPARgamma transactivation activity in HEK293 cells
Bioorg Med Chem 15: 5177-90 (2007)
Article DOI: 10.1016/j.bmc.2007.05.023
BindingDB Entry DOI: 10.7270/Q2QZ29P7
Peroxisome proliferator-activated receptor alpha (PPAR alpha)
(Homo sapiens (Human))
BDBM50214200
(2-(4-butoxy-3-((2-fluoro-4-(trifluoromethyl)benzam...)
Show SMILES CCCCOc1ccc(CC(CCC)C(O)=O)cc1CNC(=O)c1ccc(cc1F)C(F)(F)F |w:10.9|
Show InChI InChI=1S/C25H29F4NO4/c1-3-5-11-34-22-10-7-16(12-17(6-4-2)24(32)33)13-18(22)15-30-23(31)20-9-8-19(14-21(20)26)25(27,28)29/h7-10,13-14,17H,3-6,11-12,15H2,1-2H3,(H,30,31)(H,32,33)
n/an/an/an/a 820n/an/an/an/a
University of Tokyo
Curated by ChEMBL
Assay Description
Effect on PPARalpha transactivation activity in HEK293 cells
Bioorg Med Chem 15: 5177-90 (2007)
Article DOI: 10.1016/j.bmc.2007.05.023
BindingDB Entry DOI: 10.7270/Q2QZ29P7