BDBM50214359 CHEMBL103401
SMILES: CN(C)C1=NC2C(O)C(OC3OC(CO)C(OC(OC(CO)CO)C(CO)NC(C)=O)C(O)C3NC(C)=O)C(CO)C2O1
InChI Key: InChIKey=OGPBRPMBASZODE-UHFFFAOYSA-N
Data: 1 IC50
Activity Spreadsheet -- Enzyme Inhibition Constant Data from BindingDB
Found 1 hit for monomerid = 50214359
Trg + Lig
Ki
nM
ΔG°
kcal/mole
IC50
nM
Kd
nM
EC50/IC50
nM
koff
s-1
kon
M-1s-1
pHTemp
°C
Chitinase 1
(Homo sapiens (Human))
BDBM50214359
(CHEMBL103401)
Show SMILES CN(C)C1=NC2C(O)C(OC3OC(CO)C(OC(OC(CO)CO)C(CO)NC(C)=O)C(O)C3NC(C)=O)C(CO)C2O1 |t:3|
Show InChI InChI=1S/C25H44N4O14/c1-10(35)26-14(8-33)23(39-12(5-30)6-31)42-22-15(9-34)40-24(17(19(22)38)27-11(2)36)41-21-13(7-32)20-16(18(21)37)28-25(43-20)29(3)4/h12-24,30-34,37-38H,5-9H2,1-4H3,(H,26,35)(H,27,36)
n/an/a 0.0500n/an/an/an/an/an/a
University of Tokyo
Curated by ChEMBL
Assay Description
Compound was evaluated for inhibitory activity against Trichoderma Chitinase
Bioorg Med Chem Lett 8: 2987-90 (1998)
BindingDB Entry DOI: 10.7270/Q2TM7D9X