BDBM50214701 1-((R)-1-(4-(2-((S)-1-amino-3-methylbutyl)phenyl)piperazin-1-yl)-3-(2,4-dichlorophenyl)-1-oxopropan-2-yl)pyrrolidin-2-one::1-[(R)-2-{4-[2-((S)-1-amino-3-methylbutyl)phenyl]-piperazin-1-yl}-1-(2,4-dichlorobenzyl)-2-oxoethyl]pyrrolidin-2-one::CHEMBL391914
SMILES: CC(C)C[C@H](N)c1ccccc1N1CCN(CC1)C(=O)[C@@H](Cc1ccc(Cl)cc1Cl)N1CCCC1=O
InChI Key: InChIKey=OFNOTFBPXMBPPC-AZGAKELHSA-N
Data: 2 KI  2 IC50
Activity Spreadsheet -- Enzyme Inhibition Constant Data from BindingDB
Found 4 hits for monomerid = 50214701
Trg + Lig
Ki
nM
ΔG°
kcal/mole
IC50
nM
Kd
nM
EC50/IC50
nM
koff
s-1
kon
M-1s-1
pHTemp
°C
Melanocortin receptor 4
(Homo sapiens (Human))
BDBM50214701
(1-((R)-1-(4-(2-((S)-1-amino-3-methylbutyl)phenyl)p...)
Show SMILES CC(C)C[C@H](N)c1ccccc1N1CCN(CC1)C(=O)[C@@H](Cc1ccc(Cl)cc1Cl)N1CCCC1=O
Show InChI InChI=1S/C28H36Cl2N4O2/c1-19(2)16-24(31)22-6-3-4-7-25(22)32-12-14-33(15-13-32)28(36)26(34-11-5-8-27(34)35)17-20-9-10-21(29)18-23(20)30/h3-4,6-7,9-10,18-19,24,26H,5,8,11-17,31H2,1-2H3/t24-,26+/m0/s1
6.40n/an/an/an/an/an/an/an/a
Neurocrine Biosciences Inc
Curated by ChEMBL
Assay Description
Displacement of [125I]NDP-MSH from MC4R receptor in HEK293 cells
Bioorg Med Chem 15: 5166-76 (2007)
Article DOI: 10.1016/j.bmc.2007.05.026
BindingDB Entry DOI: 10.7270/Q2FF3S2P
Melanocortin receptor 4
(Homo sapiens (Human))
BDBM50214701
(1-((R)-1-(4-(2-((S)-1-amino-3-methylbutyl)phenyl)p...)
Show SMILES CC(C)C[C@H](N)c1ccccc1N1CCN(CC1)C(=O)[C@@H](Cc1ccc(Cl)cc1Cl)N1CCCC1=O
Show InChI InChI=1S/C28H36Cl2N4O2/c1-19(2)16-24(31)22-6-3-4-7-25(22)32-12-14-33(15-13-32)28(36)26(34-11-5-8-27(34)35)17-20-9-10-21(29)18-23(20)30/h3-4,6-7,9-10,18-19,24,26H,5,8,11-17,31H2,1-2H3/t24-,26+/m0/s1
6.40n/an/an/an/an/an/an/an/a
Neurocrine Biosciences, Inc.
Curated by ChEMBL
Assay Description
Binding affinity at human MC4R
Bioorg Med Chem Lett 17: 5610-3 (2007)
Article DOI: 10.1016/j.bmcl.2007.07.097
BindingDB Entry DOI: 10.7270/Q2XK8F8V
Cytochrome P450 3A4
(Homo sapiens (Human))
BDBM50214701
(1-((R)-1-(4-(2-((S)-1-amino-3-methylbutyl)phenyl)p...)
Show SMILES CC(C)C[C@H](N)c1ccccc1N1CCN(CC1)C(=O)[C@@H](Cc1ccc(Cl)cc1Cl)N1CCCC1=O
Show InChI InChI=1S/C28H36Cl2N4O2/c1-19(2)16-24(31)22-6-3-4-7-25(22)32-12-14-33(15-13-32)28(36)26(34-11-5-8-27(34)35)17-20-9-10-21(29)18-23(20)30/h3-4,6-7,9-10,18-19,24,26H,5,8,11-17,31H2,1-2H3/t24-,26+/m0/s1
Reactome pathway
n/an/a 120n/an/an/an/an/an/a
Neurocrine Biosciences, Inc.
Curated by ChEMBL
Assay Description
Inhibition of microsomal CYP3A4
Bioorg Med Chem Lett 17: 5610-3 (2007)
Article DOI: 10.1016/j.bmcl.2007.07.097
BindingDB Entry DOI: 10.7270/Q2XK8F8V
Melanocortin receptor 4
(Homo sapiens (Human))
BDBM50214701
(1-((R)-1-(4-(2-((S)-1-amino-3-methylbutyl)phenyl)p...)
Show SMILES CC(C)C[C@H](N)c1ccccc1N1CCN(CC1)C(=O)[C@@H](Cc1ccc(Cl)cc1Cl)N1CCCC1=O
Show InChI InChI=1S/C28H36Cl2N4O2/c1-19(2)16-24(31)22-6-3-4-7-25(22)32-12-14-33(15-13-32)28(36)26(34-11-5-8-27(34)35)17-20-9-10-21(29)18-23(20)30/h3-4,6-7,9-10,18-19,24,26H,5,8,11-17,31H2,1-2H3/t24-,26+/m0/s1
n/an/a 220n/an/an/an/an/an/a
Neurocrine Biosciences, Inc.
Curated by ChEMBL
Assay Description
Antagonist activity at human MC4R expressed in HEK293 cells by cAMP accumulation assay
Bioorg Med Chem Lett 17: 5610-3 (2007)
Article DOI: 10.1016/j.bmcl.2007.07.097
BindingDB Entry DOI: 10.7270/Q2XK8F8V