null
SMILES: CCN(CC)Cc1cc(F)ccc1\C=C1/Oc2ccc(O)c(OC)c2C2=C1C1C(NC(C)(C)C=C1C)C=C2
InChI Key: InChIKey=OXSIYDQGPHNGNU-YUMHPJSZSA-N
Activity Spreadsheet -- Enzyme Inhibition Constant Data from BindingDB
Found 4 hits for monomerid = 50214934
Trg + Lig
Ki
nM
ΔG°
kcal/mole
IC50
nM
Kd
nM
EC50/IC50
nM
koff
s-1
kon
M-1s-1
pHTemp
°C
Glucocorticoid receptor
(Homo sapiens (Human))
BDBM50214934
((Z)-5-(2-((diethylamino)methyl)-4-fluorobenzyliden...)
Show SMILES CCN(CC)Cc1cc(F)ccc1\C=C1/Oc2ccc(O)c(OC)c2C2=C1C1C(NC(C)(C)C=C1C)C=C2 |w:28.39,27.29,c:27,36,40|
Show InChI InChI=1S/C32H37FN2O3/c1-7-35(8-2)18-21-15-22(33)10-9-20(21)16-27-29-23(30-26(38-27)14-13-25(36)31(30)37-6)11-12-24-28(29)19(3)17-32(4,5)34-24/h9-17,24,28,34,36H,7-8,18H2,1-6H3/b27-16-
3.10n/an/an/an/an/an/an/an/a
Ligand Pharmaceuticals
Curated by ChEMBL
Assay Description
Displacement of radiolabeled dexamethasone from glucocorticoid receptor
Bioorg Med Chem Lett 17: 4158-62 (2007)
Article DOI: 10.1016/j.bmcl.2007.05.062
BindingDB Entry DOI: 10.7270/Q2DF6QXW
Glucocorticoid receptor
(Homo sapiens (Human))
BDBM50214934
((Z)-5-(2-((diethylamino)methyl)-4-fluorobenzyliden...)
Show SMILES CCN(CC)Cc1cc(F)ccc1\C=C1/Oc2ccc(O)c(OC)c2C2=C1C1C(NC(C)(C)C=C1C)C=C2 |w:28.39,27.29,c:27,36,40|
Show InChI InChI=1S/C32H37FN2O3/c1-7-35(8-2)18-21-15-22(33)10-9-20(21)16-27-29-23(30-26(38-27)14-13-25(36)31(30)37-6)11-12-24-28(29)19(3)17-32(4,5)34-24/h9-17,24,28,34,36H,7-8,18H2,1-6H3/b27-16-
n/an/a 27n/an/an/an/an/an/a
Ligand Pharmaceuticals
Curated by ChEMBL
Assay Description
Activity at GR assessed as repression of TNFalpha and IL 1beta induced E-selectin response
Bioorg Med Chem Lett 17: 4158-62 (2007)
Article DOI: 10.1016/j.bmcl.2007.05.062
BindingDB Entry DOI: 10.7270/Q2DF6QXW
Glucocorticoid receptor
(Homo sapiens (Human))
BDBM50214934
((Z)-5-(2-((diethylamino)methyl)-4-fluorobenzyliden...)
Show SMILES CCN(CC)Cc1cc(F)ccc1\C=C1/Oc2ccc(O)c(OC)c2C2=C1C1C(NC(C)(C)C=C1C)C=C2 |w:28.39,27.29,c:27,36,40|
Show InChI InChI=1S/C32H37FN2O3/c1-7-35(8-2)18-21-15-22(33)10-9-20(21)16-27-29-23(30-26(38-27)14-13-25(36)31(30)37-6)11-12-24-28(29)19(3)17-32(4,5)34-24/h9-17,24,28,34,36H,7-8,18H2,1-6H3/b27-16-
n/an/an/an/a 79n/an/an/an/a
Ligand Pharmaceuticals
Curated by ChEMBL
Assay Description
Agonist activity at GR by GRE activation assay
Bioorg Med Chem Lett 17: 4158-62 (2007)
Article DOI: 10.1016/j.bmcl.2007.05.062
BindingDB Entry DOI: 10.7270/Q2DF6QXW
Glucocorticoid receptor
(Homo sapiens (Human))
BDBM50214934
((Z)-5-(2-((diethylamino)methyl)-4-fluorobenzyliden...)
Show SMILES CCN(CC)Cc1cc(F)ccc1\C=C1/Oc2ccc(O)c(OC)c2C2=C1C1C(NC(C)(C)C=C1C)C=C2 |w:28.39,27.29,c:27,36,40|
Show InChI InChI=1S/C32H37FN2O3/c1-7-35(8-2)18-21-15-22(33)10-9-20(21)16-27-29-23(30-26(38-27)14-13-25(36)31(30)37-6)11-12-24-28(29)19(3)17-32(4,5)34-24/h9-17,24,28,34,36H,7-8,18H2,1-6H3/b27-16-
n/an/a 85n/an/an/an/an/an/a
Ligand Pharmaceuticals
Curated by ChEMBL
Assay Description
Antagonist activity at GR assessed as inhibition of dexamethasone-induced GRE activation
Bioorg Med Chem Lett 17: 4158-62 (2007)
Article DOI: 10.1016/j.bmcl.2007.05.062
BindingDB Entry DOI: 10.7270/Q2DF6QXW