BDBM50214944 10-methoxy-2,2,4-trimethyl-5-[1-m-tolyl-meth-(Z)-ylidene]-2,4a,5,12a-tetrahydro-1H-6-oxa-1-aza-chrysen-9-ol::CHEMBL232760
SMILES: COc1c(O)ccc2O\C(=C/c3cccc(C)c3)C3=C(C=CC4NC(C)(C)C=C(C)C34)c12
InChI Key: InChIKey=OSRXVTVKOPCOGY-UCQKPKSFSA-N
Data: 3 KI  2 IC50  2 EC50
Activity Spreadsheet -- Enzyme Inhibition Constant Data from BindingDB
Found 7 hits for monomerid = 50214944
Trg + Lig
Ki
nM
ΔG°
kcal/mole
IC50
nM
Kd
nM
EC50/IC50
nM
koff
s-1
kon
M-1s-1
pHTemp
°C
Glucocorticoid receptor
(Homo sapiens (Human))
BDBM50214944
(10-methoxy-2,2,4-trimethyl-5-[1-m-tolyl-meth-(Z)-y...)
Show SMILES COc1c(O)ccc2O\C(=C/c3cccc(C)c3)C3=C(C=CC4NC(C)(C)C=C(C)C34)c12 |w:22.22,30.31,c:21,t:19,28|
Show InChI InChI=1S/C28H29NO3/c1-16-7-6-8-18(13-16)14-23-25-19(26-22(32-23)12-11-21(30)27(26)31-5)9-10-20-24(25)17(2)15-28(3,4)29-20/h6-15,20,24,29-30H,1-5H3/b23-14-
2.5n/an/an/an/an/an/an/an/a
Ligand Pharmaceuticals
Curated by ChEMBL
Assay Description
Displacement of radiolabeled dexamethasone from glucocorticoid receptor
Bioorg Med Chem Lett 17: 4158-62 (2007)
Article DOI: 10.1016/j.bmcl.2007.05.062
BindingDB Entry DOI: 10.7270/Q2DF6QXW
Progesterone receptor
(Homo sapiens (Human))
BDBM50214944
(10-methoxy-2,2,4-trimethyl-5-[1-m-tolyl-meth-(Z)-y...)
Show SMILES COc1c(O)ccc2O\C(=C/c3cccc(C)c3)C3=C(C=CC4NC(C)(C)C=C(C)C34)c12 |w:22.22,30.31,c:21,t:19,28|
Show InChI InChI=1S/C28H29NO3/c1-16-7-6-8-18(13-16)14-23-25-19(26-22(32-23)12-11-21(30)27(26)31-5)9-10-20-24(25)17(2)15-28(3,4)29-20/h6-15,20,24,29-30H,1-5H3/b23-14-
400n/an/an/an/an/an/an/an/a
Ligand Pharmaceuticals
Curated by ChEMBL
Assay Description
Binding affinity at PR
Bioorg Med Chem Lett 17: 4158-62 (2007)
Article DOI: 10.1016/j.bmcl.2007.05.062
BindingDB Entry DOI: 10.7270/Q2DF6QXW
Androgen Receptor
(Homo sapiens (Human))
BDBM50214944
(10-methoxy-2,2,4-trimethyl-5-[1-m-tolyl-meth-(Z)-y...)
Show SMILES COc1c(O)ccc2O\C(=C/c3cccc(C)c3)C3=C(C=CC4NC(C)(C)C=C(C)C34)c12 |w:22.22,30.31,c:21,t:19,28|
Show InChI InChI=1S/C28H29NO3/c1-16-7-6-8-18(13-16)14-23-25-19(26-22(32-23)12-11-21(30)27(26)31-5)9-10-20-24(25)17(2)15-28(3,4)29-20/h6-15,20,24,29-30H,1-5H3/b23-14-
NCI pathway
Reactome pathway
570n/an/an/an/an/an/an/an/a
Ligand Pharmaceuticals
Curated by ChEMBL
Assay Description
Binding affinity at AR
Bioorg Med Chem Lett 17: 4158-62 (2007)
Article DOI: 10.1016/j.bmcl.2007.05.062
BindingDB Entry DOI: 10.7270/Q2DF6QXW
Glucocorticoid receptor
(Homo sapiens (Human))
BDBM50214944
(10-methoxy-2,2,4-trimethyl-5-[1-m-tolyl-meth-(Z)-y...)
Show SMILES COc1c(O)ccc2O\C(=C/c3cccc(C)c3)C3=C(C=CC4NC(C)(C)C=C(C)C34)c12 |w:22.22,30.31,c:21,t:19,28|
Show InChI InChI=1S/C28H29NO3/c1-16-7-6-8-18(13-16)14-23-25-19(26-22(32-23)12-11-21(30)27(26)31-5)9-10-20-24(25)17(2)15-28(3,4)29-20/h6-15,20,24,29-30H,1-5H3/b23-14-
n/an/an/an/a>1.00E+3n/an/an/an/a
Ligand Pharmaceuticals
Curated by ChEMBL
Assay Description
Agonist activity at GR by GRE activation assay relative to dexamethasone
Bioorg Med Chem Lett 17: 4158-62 (2007)
Article DOI: 10.1016/j.bmcl.2007.05.062
BindingDB Entry DOI: 10.7270/Q2DF6QXW
Glucocorticoid receptor
(Homo sapiens (Human))
BDBM50214944
(10-methoxy-2,2,4-trimethyl-5-[1-m-tolyl-meth-(Z)-y...)
Show SMILES COc1c(O)ccc2O\C(=C/c3cccc(C)c3)C3=C(C=CC4NC(C)(C)C=C(C)C34)c12 |w:22.22,30.31,c:21,t:19,28|
Show InChI InChI=1S/C28H29NO3/c1-16-7-6-8-18(13-16)14-23-25-19(26-22(32-23)12-11-21(30)27(26)31-5)9-10-20-24(25)17(2)15-28(3,4)29-20/h6-15,20,24,29-30H,1-5H3/b23-14-
n/an/a 0.200n/an/an/an/an/an/a
Ligand Pharmaceuticals
Curated by ChEMBL
Assay Description
Antagonist activity at GR assessed as inhibition of dexamethasone-induced GRE activation
Bioorg Med Chem Lett 17: 4158-62 (2007)
Article DOI: 10.1016/j.bmcl.2007.05.062
BindingDB Entry DOI: 10.7270/Q2DF6QXW
Glucocorticoid receptor
(Homo sapiens (Human))
BDBM50214944
(10-methoxy-2,2,4-trimethyl-5-[1-m-tolyl-meth-(Z)-y...)
Show SMILES COc1c(O)ccc2O\C(=C/c3cccc(C)c3)C3=C(C=CC4NC(C)(C)C=C(C)C34)c12 |w:22.22,30.31,c:21,t:19,28|
Show InChI InChI=1S/C28H29NO3/c1-16-7-6-8-18(13-16)14-23-25-19(26-22(32-23)12-11-21(30)27(26)31-5)9-10-20-24(25)17(2)15-28(3,4)29-20/h6-15,20,24,29-30H,1-5H3/b23-14-
n/an/a 0.900n/an/an/an/an/an/a
Ligand Pharmaceuticals
Curated by ChEMBL
Assay Description
Activity at GR assessed as repression of TNFalpha and IL 1beta induced E-selectin response
Bioorg Med Chem Lett 17: 4158-62 (2007)
Article DOI: 10.1016/j.bmcl.2007.05.062
BindingDB Entry DOI: 10.7270/Q2DF6QXW
Glucocorticoid receptor
(Homo sapiens (Human))
BDBM50214944
(10-methoxy-2,2,4-trimethyl-5-[1-m-tolyl-meth-(Z)-y...)
Show SMILES COc1c(O)ccc2O\C(=C/c3cccc(C)c3)C3=C(C=CC4NC(C)(C)C=C(C)C34)c12 |w:22.22,30.31,c:21,t:19,28|
Show InChI InChI=1S/C28H29NO3/c1-16-7-6-8-18(13-16)14-23-25-19(26-22(32-23)12-11-21(30)27(26)31-5)9-10-20-24(25)17(2)15-28(3,4)29-20/h6-15,20,24,29-30H,1-5H3/b23-14-
n/an/an/an/a>1.00E+3n/an/an/an/a
Ligand Pharmaceuticals
Curated by ChEMBL
Assay Description
Agonist activity at GR by GRE activation assay
Bioorg Med Chem Lett 17: 4158-62 (2007)
Article DOI: 10.1016/j.bmcl.2007.05.062
BindingDB Entry DOI: 10.7270/Q2DF6QXW