BDBM50214946 (Z)-5-(2-methyl-3-(trifluoromethyl)benzylidene)-10-methoxy-2,2,4-trimethyl-2,4a,5,12a-tetrahydro-1H-chromeno[3,4-f]quinolin-9-ol::CHEMBL232375
SMILES: COc1c(O)ccc2O\C(=C/c3cccc(c3C)C(F)(F)F)C3=C(C=CC4NC(C)(C)C=C(C)C34)c12
InChI Key: InChIKey=DEMHWEPQBPLWKL-QRVIBDJDSA-N
Data: 1 KI  2 IC50
Activity Spreadsheet -- Enzyme Inhibition Constant Data from BindingDB
Found 3 hits for monomerid = 50214946
Trg + Lig
Ki
nM
ΔG°
kcal/mole
IC50
nM
Kd
nM
EC50/IC50
nM
koff
s-1
kon
M-1s-1
pHTemp
°C
Glucocorticoid receptor
(Homo sapiens (Human))
BDBM50214946
((Z)-5-(2-methyl-3-(trifluoromethyl)benzylidene)-10...)
Show SMILES COc1c(O)ccc2O\C(=C/c3cccc(c3C)C(F)(F)F)C3=C(C=CC4NC(C)(C)C=C(C)C34)c12 |w:26.26,34.35,c:25,t:23,32|
Show InChI InChI=1S/C29H28F3NO3/c1-15-14-28(3,4)33-20-10-9-18-25(24(15)20)23(36-22-12-11-21(34)27(35-5)26(18)22)13-17-7-6-8-19(16(17)2)29(30,31)32/h6-14,20,24,33-34H,1-5H3/b23-13-
2.60n/an/an/an/an/an/an/an/a
Ligand Pharmaceuticals
Curated by ChEMBL
Assay Description
Displacement of radiolabeled dexamethasone from glucocorticoid receptor
Bioorg Med Chem Lett 17: 4158-62 (2007)
Article DOI: 10.1016/j.bmcl.2007.05.062
BindingDB Entry DOI: 10.7270/Q2DF6QXW
Glucocorticoid receptor
(Homo sapiens (Human))
BDBM50214946
((Z)-5-(2-methyl-3-(trifluoromethyl)benzylidene)-10...)
Show SMILES COc1c(O)ccc2O\C(=C/c3cccc(c3C)C(F)(F)F)C3=C(C=CC4NC(C)(C)C=C(C)C34)c12 |w:26.26,34.35,c:25,t:23,32|
Show InChI InChI=1S/C29H28F3NO3/c1-15-14-28(3,4)33-20-10-9-18-25(24(15)20)23(36-22-12-11-21(34)27(35-5)26(18)22)13-17-7-6-8-19(16(17)2)29(30,31)32/h6-14,20,24,33-34H,1-5H3/b23-13-
n/an/a 15n/an/an/an/an/an/a
Ligand Pharmaceuticals
Curated by ChEMBL
Assay Description
Activity at GR assessed as repression of TNFalpha and IL 1beta induced E-selectin response
Bioorg Med Chem Lett 17: 4158-62 (2007)
Article DOI: 10.1016/j.bmcl.2007.05.062
BindingDB Entry DOI: 10.7270/Q2DF6QXW
Glucocorticoid receptor
(Homo sapiens (Human))
BDBM50214946
((Z)-5-(2-methyl-3-(trifluoromethyl)benzylidene)-10...)
Show SMILES COc1c(O)ccc2O\C(=C/c3cccc(c3C)C(F)(F)F)C3=C(C=CC4NC(C)(C)C=C(C)C34)c12 |w:26.26,34.35,c:25,t:23,32|
Show InChI InChI=1S/C29H28F3NO3/c1-15-14-28(3,4)33-20-10-9-18-25(24(15)20)23(36-22-12-11-21(34)27(35-5)26(18)22)13-17-7-6-8-19(16(17)2)29(30,31)32/h6-14,20,24,33-34H,1-5H3/b23-13-
n/an/a 2.60n/an/an/an/an/an/a
Ligand Pharmaceuticals
Curated by ChEMBL
Assay Description
Antagonist activity at GR assessed as inhibition of dexamethasone-induced GRE activation
Bioorg Med Chem Lett 17: 4158-62 (2007)
Article DOI: 10.1016/j.bmcl.2007.05.062
BindingDB Entry DOI: 10.7270/Q2DF6QXW