BDBM50215126 CHEMBL414417
SMILES: Cc1cn(Cc2ccc(cc2)C(F)(F)F)c2cc(ccc12)C(=O)Nc1c(Cl)c[n+]([O-])cc1Cl
InChI Key: InChIKey=LBNIQKADHDXTKV-UHFFFAOYSA-N
Data: 1 KI  1 IC50
Activity Spreadsheet -- Enzyme Inhibition Constant Data from BindingDB
Found 2 hits for monomerid = 50215126
Trg + Lig
Ki
nM
ΔG°
kcal/mole
IC50
nM
Kd
nM
EC50/IC50
nM
koff
s-1
kon
M-1s-1
pHTemp
°C
Phosphodiesterase 4
(Homo sapiens (Human))
BDBM50215126
(CHEMBL414417)
Show SMILES Cc1cn(Cc2ccc(cc2)C(F)(F)F)c2cc(ccc12)C(=O)Nc1c(Cl)c[n+]([O-])cc1Cl
Show InChI InChI=1S/C23H16Cl2F3N3O2/c1-13-9-30(10-14-2-5-16(6-3-14)23(26,27)28)20-8-15(4-7-17(13)20)22(32)29-21-18(24)11-31(33)12-19(21)25/h2-9,11-12H,10H2,1H3,(H,29,32)
67n/an/an/an/an/an/an/an/a
Rh£ne-Poulenc Rorer Central Research
Curated by ChEMBL
Assay Description
Affinity for rolipram binding site of phosphodiesterase type IV (PDE4)
Bioorg Med Chem Lett 8: 3053-8 (1998)
BindingDB Entry DOI: 10.7270/Q2PV6NK6
Phosphodiesterase 4
(Homo sapiens (Human))
BDBM50215126
(CHEMBL414417)
Show SMILES Cc1cn(Cc2ccc(cc2)C(F)(F)F)c2cc(ccc12)C(=O)Nc1c(Cl)c[n+]([O-])cc1Cl
Show InChI InChI=1S/C23H16Cl2F3N3O2/c1-13-9-30(10-14-2-5-16(6-3-14)23(26,27)28)20-8-15(4-7-17(13)20)22(32)29-21-18(24)11-31(33)12-19(21)25/h2-9,11-12H,10H2,1H3,(H,29,32)
n/an/a 14n/an/an/an/an/an/a
Rh£ne-Poulenc Rorer Central Research
Curated by ChEMBL
Assay Description
Inhibition of phosphodiesterase type IV (PDE4) activity
Bioorg Med Chem Lett 8: 3053-8 (1998)
BindingDB Entry DOI: 10.7270/Q2PV6NK6