BDBM50215231 12-(2-hexyl-5-hydroxy-phenoxy)-dodecanoic acidcyclopropylamide::CHEMBL374369
SMILES: CCCCCCc1c(O)cccc1OCCCCCCCCCCCC(=O)NC1CC1
InChI Key: InChIKey=JHGUWCGGYDWNIQ-UHFFFAOYSA-N
Data: 2 KI  1 IC50
Activity Spreadsheet -- Enzyme Inhibition Constant Data from BindingDB
Found 3 hits for monomerid = 50215231
Trg + Lig
Ki
nM
ΔG°
kcal/mole
IC50
nM
Kd
nM
EC50/IC50
nM
koff
s-1
kon
M-1s-1
pHTemp
°C
Cannabinoid receptor 1
(Homo sapiens (Human))
BDBM50215231
(12-(2-hexyl-5-hydroxy-phenoxy)-dodecanoic acidcycl...)
Show SMILES CCCCCCc1c(O)cccc1OCCCCCCCCCCCC(=O)NC1CC1
Show InChI InChI=1S/C27H45NO3/c1-2-3-4-12-16-24-25(29)17-15-18-26(24)31-22-14-11-9-7-5-6-8-10-13-19-27(30)28-23-20-21-23/h15,17-18,23,29H,2-14,16,19-22H2,1H3,(H,28,30)
NCI pathway
Reactome pathway
13n/an/an/an/an/an/an/an/a
Universit£ degli Studi di Siena
Curated by ChEMBL
Assay Description
Displacement of [3H]CP-55940 from human CB1 receptor expressed in HEK cells
Bioorg Med Chem 15: 5406-16 (2007)
Article DOI: 10.1016/j.bmc.2007.05.060
BindingDB Entry DOI: 10.7270/Q2T154G7
Cannabinoid receptor 2
(Homo sapiens (Human))
BDBM50215231
(12-(2-hexyl-5-hydroxy-phenoxy)-dodecanoic acidcycl...)
Show SMILES CCCCCCc1c(O)cccc1OCCCCCCCCCCCC(=O)NC1CC1
Show InChI InChI=1S/C27H45NO3/c1-2-3-4-12-16-24-25(29)17-15-18-26(24)31-22-14-11-9-7-5-6-8-10-13-19-27(30)28-23-20-21-23/h15,17-18,23,29H,2-14,16,19-22H2,1H3,(H,28,30)
Reactome pathway
39n/an/an/an/an/an/an/an/a
Universit£ degli Studi di Siena
Curated by ChEMBL
Assay Description
Displacement of [3H]CP-55940 from human CB2 receptor expressed in HEK cells
Bioorg Med Chem 15: 5406-16 (2007)
Article DOI: 10.1016/j.bmc.2007.05.060
BindingDB Entry DOI: 10.7270/Q2T154G7
Fatty-acid amide hydrolase 1 (aa 30-579)
(Rattus norvegicus (rat))
BDBM50215231
(12-(2-hexyl-5-hydroxy-phenoxy)-dodecanoic acidcycl...)
Show SMILES CCCCCCc1c(O)cccc1OCCCCCCCCCCCC(=O)NC1CC1
Show InChI InChI=1S/C27H45NO3/c1-2-3-4-12-16-24-25(29)17-15-18-26(24)31-22-14-11-9-7-5-6-8-10-13-19-27(30)28-23-20-21-23/h15,17-18,23,29H,2-14,16,19-22H2,1H3,(H,28,30)
n/an/a>5.00E+4n/an/an/an/an/an/a
Universit£ degli Studi di Siena
Curated by ChEMBL
Assay Description
Inhibition of rat brain FAAH assessed as inhibition of [14C]anandamide hydrolysis
Bioorg Med Chem 15: 5406-16 (2007)
Article DOI: 10.1016/j.bmc.2007.05.060
BindingDB Entry DOI: 10.7270/Q2T154G7