BDBM50215286 CHEMBL399275::N-(6,7-dichloro-2,3-dioxo-1,2,3,4-tetrahydroquinoxalin-5-yl)-N-(3-methoxypropyl)methanesulfonamide
SMILES: COCCCN(c1c(Cl)c(Cl)cc2[nH]c(=O)c(=O)[nH]c12)S(C)(=O)=O
InChI Key: InChIKey=HCVVJCJMDGFGMO-UHFFFAOYSA-N
Data: 3 IC50
Activity Spreadsheet -- Enzyme Inhibition Constant Data from BindingDB
Found 3 hits for monomerid = 50215286
Trg + Lig
Ki
nM
ΔG°
kcal/mole
IC50
nM
Kd
nM
EC50/IC50
nM
koff
s-1
kon
M-1s-1
pHTemp
°C
Glutamate receptor ionotropic, NMDA 1
(Homo sapiens (Human))
BDBM50215286
(CHEMBL399275 | N-(6,7-dichloro-2,3-dioxo-1,2,3,4-t...)
Show SMILES COCCCN(c1c(Cl)c(Cl)cc2[nH]c(=O)c(=O)[nH]c12)S(C)(=O)=O
Show InChI InChI=1S/C13H15Cl2N3O5S/c1-23-5-3-4-18(24(2,21)22)11-9(15)7(14)6-8-10(11)17-13(20)12(19)16-8/h6H,3-5H2,1-2H3,(H,16,19)(H,17,20)
n/an/a 24n/an/an/an/an/an/a
Pfizer Global Research and Development
Curated by ChEMBL
Assay Description
Antagonist activity at human NMDA NR1 receptor
Bioorg Med Chem Lett 17: 4599-603 (2007)
Article DOI: 10.1016/j.bmcl.2007.05.083
BindingDB Entry DOI: 10.7270/Q2QR4WTR
Glutamate receptor ionotropic, NMDA 1
(Homo sapiens (Human))
BDBM50215286
(CHEMBL399275 | N-(6,7-dichloro-2,3-dioxo-1,2,3,4-t...)
Show SMILES COCCCN(c1c(Cl)c(Cl)cc2[nH]c(=O)c(=O)[nH]c12)S(C)(=O)=O
Show InChI InChI=1S/C13H15Cl2N3O5S/c1-23-5-3-4-18(24(2,21)22)11-9(15)7(14)6-8-10(11)17-13(20)12(19)16-8/h6H,3-5H2,1-2H3,(H,16,19)(H,17,20)
n/an/a 282n/an/an/an/an/an/a
Pfizer Global Research and Development
Curated by ChEMBL
Assay Description
Antagonist activity at human NMDA NR1 receptor
Bioorg Med Chem Lett 17: 4599-603 (2007)
Article DOI: 10.1016/j.bmcl.2007.05.083
BindingDB Entry DOI: 10.7270/Q2QR4WTR
Glutamate receptor ionotropic, NMDA 1
(Homo sapiens (Human))
BDBM50215286
(CHEMBL399275 | N-(6,7-dichloro-2,3-dioxo-1,2,3,4-t...)
Show SMILES COCCCN(c1c(Cl)c(Cl)cc2[nH]c(=O)c(=O)[nH]c12)S(C)(=O)=O
Show InChI InChI=1S/C13H15Cl2N3O5S/c1-23-5-3-4-18(24(2,21)22)11-9(15)7(14)6-8-10(11)17-13(20)12(19)16-8/h6H,3-5H2,1-2H3,(H,16,19)(H,17,20)
n/an/a 8n/an/an/an/an/an/a
Pfizer Global Research and Development
Curated by ChEMBL
Assay Description
Antagonist activity at human NMDA NR1 receptor
Bioorg Med Chem Lett 17: 4599-603 (2007)
Article DOI: 10.1016/j.bmcl.2007.05.083
BindingDB Entry DOI: 10.7270/Q2QR4WTR