BDBM50215287 CHEMBL247035::N-(3-methoxybenzyl)-N-(6,7-dichloro-2,3-dioxo-1,2,3,4-tetrahydroquinoxalin-5-yl)methanesulfonamide
SMILES: COc1cccc(CN(c2c(Cl)c(Cl)cc3[nH]c(=O)c(=O)[nH]c23)S(C)(=O)=O)c1
InChI Key: InChIKey=PWASGNSKQZGAOY-UHFFFAOYSA-N
Data: 1 IC50
Activity Spreadsheet -- Enzyme Inhibition Constant Data from BindingDB
Found 1 hit for monomerid = 50215287
Trg + Lig
Ki
nM
ΔG°
kcal/mole
IC50
nM
Kd
nM
EC50/IC50
nM
koff
s-1
kon
M-1s-1
pHTemp
°C
Glutamate receptor ionotropic, NMDA 1
(Homo sapiens (Human))
BDBM50215287
(CHEMBL247035 | N-(3-methoxybenzyl)-N-(6,7-dichloro...)
Show SMILES COc1cccc(CN(c2c(Cl)c(Cl)cc3[nH]c(=O)c(=O)[nH]c23)S(C)(=O)=O)c1
Show InChI InChI=1S/C17H15Cl2N3O5S/c1-27-10-5-3-4-9(6-10)8-22(28(2,25)26)15-13(19)11(18)7-12-14(15)21-17(24)16(23)20-12/h3-7H,8H2,1-2H3,(H,20,23)(H,21,24)
n/an/a 12n/an/an/an/an/an/a
Pfizer Global Research and Development
Curated by ChEMBL
Assay Description
Antagonist activity at human NMDA NR1 receptor
Bioorg Med Chem Lett 17: 4599-603 (2007)
Article DOI: 10.1016/j.bmcl.2007.05.083
BindingDB Entry DOI: 10.7270/Q2QR4WTR