BDBM50215294 2-(N-(6-chloro-7-methyl-2,3-dioxo-1,2,3,4-tetrahydroquinoxalin-5-yl)methan-14-ylsulfonamido)acetic acid::CHEMBL248247
SMILES: Cc1cc2[nH]c(=O)c(=O)[nH]c2c(N(CC(O)=O)S(C)(=O)=O)c1Cl
InChI Key: InChIKey=JQCXJCAKYWSWCH-UHFFFAOYSA-N
Data: 1 IC50
Activity Spreadsheet -- Enzyme Inhibition Constant Data from BindingDB
Found 1 hit for monomerid = 50215294
Trg + Lig
Ki
nM
ΔG°
kcal/mole
IC50
nM
Kd
nM
EC50/IC50
nM
koff
s-1
kon
M-1s-1
pHTemp
°C
Glutamate receptor ionotropic, NMDA 1
(Homo sapiens (Human))
BDBM50215294
(2-(N-(6-chloro-7-methyl-2,3-dioxo-1,2,3,4-tetrahyd...)
Show SMILES Cc1cc2[nH]c(=O)c(=O)[nH]c2c(N(CC(O)=O)S(C)(=O)=O)c1Cl
Show InChI InChI=1S/C12H12ClN3O6S/c1-5-3-6-9(15-12(20)11(19)14-6)10(8(5)13)16(4-7(17)18)23(2,21)22/h3H,4H2,1-2H3,(H,14,19)(H,15,20)(H,17,18)
n/an/a 1n/an/an/an/an/an/a
Pfizer Global Research and Development
Curated by ChEMBL
Assay Description
Antagonist activity at human NMDA NR1 receptor
Bioorg Med Chem Lett 17: 4599-603 (2007)
Article DOI: 10.1016/j.bmcl.2007.05.083
BindingDB Entry DOI: 10.7270/Q2QR4WTR