BDBM50215369 CHEMBL368290
SMILES: CCC(CC)(CC(=O)Nc1cccc(OCc2ccc3c(F)cccc3n2)c1)C(O)=O
InChI Key: InChIKey=RHXDSNDNDGKMLP-UHFFFAOYSA-N
Data: 1 IC50
Activity Spreadsheet -- Enzyme Inhibition Constant Data from BindingDB
Found 1 hit for monomerid = 50215369
Trg + Lig
Ki
nM
ΔG°
kcal/mole
IC50
nM
Kd
nM
EC50/IC50
nM
koff
s-1
kon
M-1s-1
pHTemp
°C
Cysteinyl leukotriene receptor
(Homo sapiens (Human))
BDBM50215369
(CHEMBL368290)
Show SMILES CCC(CC)(CC(=O)Nc1cccc(OCc2ccc3c(F)cccc3n2)c1)C(O)=O
Show InChI InChI=1S/C24H25FN2O4/c1-3-24(4-2,23(29)30)14-22(28)27-16-7-5-8-18(13-16)31-15-17-11-12-19-20(25)9-6-10-21(19)26-17/h5-13H,3-4,14-15H2,1-2H3,(H,27,28)(H,29,30)
n/an/a 0.300n/an/an/an/an/an/a
Novartis Pharma AG
Curated by ChEMBL
Assay Description
In vitro for antagonistic activity against LTD4 receptor in guinea pig ileum
Bioorg Med Chem Lett 8: 965-70 (1999)
BindingDB Entry DOI: 10.7270/Q2V123XT