BDBM50215370 CHEMBL174265
SMILES: CCCCC(CCCC)(CC(=O)Nc1cccc(OCc2ccc3ccc(F)cc3n2)c1)C(O)=O
InChI Key: InChIKey=XBNBASSLEBZZPC-UHFFFAOYSA-N
Data: 1 IC50
Activity Spreadsheet -- Enzyme Inhibition Constant Data from BindingDB
Found 1 hit for monomerid = 50215370
Trg + Lig
Ki
nM
ΔG°
kcal/mole
IC50
nM
Kd
nM
EC50/IC50
nM
koff
s-1
kon
M-1s-1
pHTemp
°C
Cysteinyl leukotriene receptor
(Homo sapiens (Human))
BDBM50215370
(CHEMBL174265)
Show SMILES CCCCC(CCCC)(CC(=O)Nc1cccc(OCc2ccc3ccc(F)cc3n2)c1)C(O)=O
Show InChI InChI=1S/C28H33FN2O4/c1-3-5-14-28(27(33)34,15-6-4-2)18-26(32)31-22-8-7-9-24(17-22)35-19-23-13-11-20-10-12-21(29)16-25(20)30-23/h7-13,16-17H,3-6,14-15,18-19H2,1-2H3,(H,31,32)(H,33,34)
n/an/a 1n/an/an/an/an/an/a
Novartis Pharma AG
Curated by ChEMBL
Assay Description
In vitro for antagonistic activity against LTD4 receptor in guinea pig ileum
Bioorg Med Chem Lett 8: 965-70 (1999)
BindingDB Entry DOI: 10.7270/Q2V123XT