BDBM50215407 CHEMBL175382
SMILES: CCC(C)(CC(=O)Nc1cccc(OCc2ccc3ccc(F)cc3n2)c1)C(O)=O
InChI Key: InChIKey=KMDMEBAGSHHFKW-UHFFFAOYSA-N
Data: 1 IC50
Activity Spreadsheet -- Enzyme Inhibition Constant Data from BindingDB
Found 1 hit for monomerid = 50215407
Trg + Lig
Ki
nM
ΔG°
kcal/mole
IC50
nM
Kd
nM
EC50/IC50
nM
koff
s-1
kon
M-1s-1
pHTemp
°C
Cysteinyl leukotriene receptor
(Homo sapiens (Human))
BDBM50215407
(CHEMBL175382)
Show SMILES CCC(C)(CC(=O)Nc1cccc(OCc2ccc3ccc(F)cc3n2)c1)C(O)=O
Show InChI InChI=1S/C23H23FN2O4/c1-3-23(2,22(28)29)13-21(27)26-17-5-4-6-19(12-17)30-14-18-10-8-15-7-9-16(24)11-20(15)25-18/h4-12H,3,13-14H2,1-2H3,(H,26,27)(H,28,29)
n/an/a 6.40n/an/an/an/an/an/a
Novartis Pharma AG
Curated by ChEMBL
Assay Description
In vitro for antagonistic activity against LTD4 receptor in guinea pig ileum
Bioorg Med Chem Lett 8: 965-70 (1999)
BindingDB Entry DOI: 10.7270/Q2V123XT