BDBM50215489 6-hydroxy-2,3,4,9-tetrahydro-1H-pyrido[3,4-b]indole-1-carboxylic acid::CHEMBL246099
SMILES: OC(=O)C1NCCc2c1[nH]c1ccc(O)cc21
InChI Key: InChIKey=KDTKEEBTTHBVSR-UHFFFAOYSA-N
Data: 1 IC50
Activity Spreadsheet -- Enzyme Inhibition Constant Data from BindingDB
Found 1 hit for monomerid = 50215489
Trg + Lig
Ki
nM
ΔG°
kcal/mole
IC50
nM
Kd
nM
EC50/IC50
nM
koff
s-1
kon
M-1s-1
pHTemp
°C
MAP kinase-activated protein kinase 2
(Homo sapiens (Human))
BDBM50215489
(6-hydroxy-2,3,4,9-tetrahydro-1H-pyrido[3,4-b]indol...)
Show SMILES OC(=O)C1NCCc2c1[nH]c1ccc(O)cc21 |w:3.2|
Show InChI InChI=1S/C12H12N2O3/c15-6-1-2-9-8(5-6)7-3-4-13-11(12(16)17)10(7)14-9/h1-2,5,11,13-15H,3-4H2,(H,16,17)
NCI pathway
Reactome pathway
n/an/a 4.50E+3n/an/an/an/an/an/a
Pfizer Global Research and Development
Curated by ChEMBL
Assay Description
Inhibition of MK2
Bioorg Med Chem Lett 17: 4657-63 (2007)
Article DOI: 10.1016/j.bmcl.2007.05.070
BindingDB Entry DOI: 10.7270/Q2PR7VPC