BDBM50215504 CHEMBL245662::propyl 5-methoxy-9,12-diazatetracyclo[10.2.1.0^{2,10}.0^{3,8}]pentadeca-2(10),3,5,7-tetraene-11-carboxylate
SMILES: CCCOC(=O)C1N2CCC(C2)c2c1[nH]c1ccc(OC)cc21
InChI Key: InChIKey=PLLMARXCWGFAJQ-UHFFFAOYSA-N
Data: 1 IC50
Activity Spreadsheet -- Enzyme Inhibition Constant Data from BindingDB
Found 1 hit for monomerid = 50215504
Trg + Lig
Ki
nM
ΔG°
kcal/mole
IC50
nM
Kd
nM
EC50/IC50
nM
koff
s-1
kon
M-1s-1
pHTemp
°C
MAP kinase-activated protein kinase 2
(Homo sapiens (Human))
BDBM50215504
(CHEMBL245662 | propyl 5-methoxy-9,12-diazatetracyc...)
Show SMILES CCCOC(=O)C1N2CCC(C2)c2c1[nH]c1ccc(OC)cc21 |w:10.10,6.5,TEB:4:6:11:9.8|
Show InChI InChI=1S/C18H22N2O3/c1-3-8-23-18(21)17-16-15(11-6-7-20(17)10-11)13-9-12(22-2)4-5-14(13)19-16/h4-5,9,11,17,19H,3,6-8,10H2,1-2H3
NCI pathway
Reactome pathway
n/an/a 1.01E+4n/an/an/an/an/an/a
Pfizer Global Research and Development
Curated by ChEMBL
Assay Description
Inhibition of MK2
Bioorg Med Chem Lett 17: 4657-63 (2007)
Article DOI: 10.1016/j.bmcl.2007.05.070
BindingDB Entry DOI: 10.7270/Q2PR7VPC