BDBM50215511 6-chloro-2,3,4,9-tetrahydro-1H-pyrido[3,4-b]indole-1-carboxylic acid::CHEMBL246102
SMILES: OC(=O)C1NCCc2c1[nH]c1ccc(Cl)cc21
InChI Key: InChIKey=CMQSGMXGIWWFHN-UHFFFAOYSA-N
Data: 1 IC50
Activity Spreadsheet -- Enzyme Inhibition Constant Data from BindingDB
Found 1 hit for monomerid = 50215511
Trg + Lig
Ki
nM
ΔG°
kcal/mole
IC50
nM
Kd
nM
EC50/IC50
nM
koff
s-1
kon
M-1s-1
pHTemp
°C
MAP kinase-activated protein kinase 2
(Homo sapiens (Human))
BDBM50215511
(6-chloro-2,3,4,9-tetrahydro-1H-pyrido[3,4-b]indole...)
Show SMILES OC(=O)C1NCCc2c1[nH]c1ccc(Cl)cc21 |w:3.2|
Show InChI InChI=1S/C12H11ClN2O2/c13-6-1-2-9-8(5-6)7-3-4-14-11(12(16)17)10(7)15-9/h1-2,5,11,14-15H,3-4H2,(H,16,17)
NCI pathway
Reactome pathway
n/an/a 1.90E+4n/an/an/an/an/an/a
Pfizer Global Research and Development
Curated by ChEMBL
Assay Description
Inhibition of MK2
Bioorg Med Chem Lett 17: 4657-63 (2007)
Article DOI: 10.1016/j.bmcl.2007.05.070
BindingDB Entry DOI: 10.7270/Q2PR7VPC