BDBM50215516 2,3,4,9-tetrahydro-1H-pyrido[3,4-b]indole-1-carboxylic acid::CHEMBL246101
SMILES: OC(=O)C1NCCc2c1[nH]c1ccccc21
InChI Key: InChIKey=XGCIVVYTCDKDLC-UHFFFAOYSA-N
Data: 1 IC50
Activity Spreadsheet -- Enzyme Inhibition Constant Data from BindingDB
Found 1 hit for monomerid = 50215516
Trg + Lig
Ki
nM
ΔG°
kcal/mole
IC50
nM
Kd
nM
EC50/IC50
nM
koff
s-1
kon
M-1s-1
pHTemp
°C
MAP kinase-activated protein kinase 2
(Homo sapiens (Human))
BDBM50215516
(2,3,4,9-tetrahydro-1H-pyrido[3,4-b]indole-1-carbox...)
Show SMILES OC(=O)C1NCCc2c1[nH]c1ccccc21 |w:3.2|
Show InChI InChI=1S/C12H12N2O2/c15-12(16)11-10-8(5-6-13-11)7-3-1-2-4-9(7)14-10/h1-4,11,13-14H,5-6H2,(H,15,16)
NCI pathway
Reactome pathway
n/an/a 8.70E+4n/an/an/an/an/an/a
Pfizer Global Research and Development
Curated by ChEMBL
Assay Description
Inhibition of MK2
Bioorg Med Chem Lett 17: 4657-63 (2007)
Article DOI: 10.1016/j.bmcl.2007.05.070
BindingDB Entry DOI: 10.7270/Q2PR7VPC