BDBM50215522 5-methoxy-2,3,4,9-tetrahydro-1H-pyrido[3,4-b]indole-1-carboxylic acid::CHEMBL247138
SMILES: COc1cccc2[nH]c3C(NCCc3c12)C(O)=O
InChI Key: InChIKey=DRQGUKDLNGJXQY-UHFFFAOYSA-N
Data: 1 IC50
Activity Spreadsheet -- Enzyme Inhibition Constant Data from BindingDB
Found 1 hit for monomerid = 50215522
Trg + Lig
Ki
nM
ΔG°
kcal/mole
IC50
nM
Kd
nM
EC50/IC50
nM
koff
s-1
kon
M-1s-1
pHTemp
°C
MAP kinase-activated protein kinase 2
(Homo sapiens (Human))
BDBM50215522
(5-methoxy-2,3,4,9-tetrahydro-1H-pyrido[3,4-b]indol...)
Show SMILES COc1cccc2[nH]c3C(NCCc3c12)C(O)=O |w:9.17|
Show InChI InChI=1S/C13H14N2O3/c1-18-9-4-2-3-8-10(9)7-5-6-14-12(13(16)17)11(7)15-8/h2-4,12,14-15H,5-6H2,1H3,(H,16,17)
NCI pathway
Reactome pathway
n/an/a 4.20E+4n/an/an/an/an/an/a
Pfizer Global Research and Development
Curated by ChEMBL
Assay Description
Inhibition of MK2
Bioorg Med Chem Lett 17: 4657-63 (2007)
Article DOI: 10.1016/j.bmcl.2007.05.070
BindingDB Entry DOI: 10.7270/Q2PR7VPC