null
SMILES: [#6]-[#6]-[#6@H](-[#6])-[#6@H](-[#7]-[#6](=O)-[#6@H](-[#6]-[#6]-[#6]-[#6]-[#7])-[#7]-[#6](=O)-c1cc(-[#8])ccc1-[#8])-[#6](=O)-[#7]-[#6@@H](-[#6]-c1ccccc1)-[#6](=O)-[#7]-[#6@@H](-[#6]-[#6]-[#6]\[#7]=[#6](\[#7])-[#7])-[#6](-[#8])=O
InChI Key: InChIKey=UJBHGRWITVPYAE-QPGFMSSHSA-N
Activity Spreadsheet -- Enzyme Inhibition Constant Data from BindingDB
Found 1 hit for monomerid = 50215570
Trg + Lig
Ki
nM
ΔG°
kcal/mole
IC50
nM
Kd
nM
EC50/IC50
nM
koff
s-1
kon
M-1s-1
pHTemp
°C
Prothrombin
(Homo sapiens (Human))
BDBM50215570
(CHEMBL2372732)
Show SMILES [#6]-[#6]-[#6@H](-[#6])-[#6@H](-[#7]-[#6](=O)-[#6@H](-[#6]-[#6]-[#6]-[#6]-[#7])-[#7]-[#6](=O)-c1cc(-[#8])ccc1-[#8])-[#6](=O)-[#7]-[#6@@H](-[#6]-c1ccccc1)-[#6](=O)-[#7]-[#6@@H](-[#6]-[#6]-[#6]\[#7]=[#6](\[#7])-[#7])-[#6](-[#8])=O
Show InChI InChI=1S/C34H50N8O8/c1-3-20(2)28(42-30(46)24(12-7-8-16-35)39-29(45)23-19-22(43)14-15-27(23)44)32(48)41-26(18-21-10-5-4-6-11-21)31(47)40-25(33(49)50)13-9-17-38-34(36)37/h4-6,10-11,14-15,19-20,24-26,28,43-44H,3,7-9,12-13,16-18,35H2,1-2H3,(H,39,45)(H,40,47)(H,41,48)(H,42,46)(H,49,50)(H4,36,37,38)/t20-,24-,25-,26-,28-/m0/s1
n/an/a 1.90E+3n/an/an/an/a8.3n/a
Central Drug Research Institute
Curated by ChEMBL
Assay Description
Anti-thrombin activity by competitive enzyme assay using the fluorogenic substrate Tos-Gly-Pro-Arg-AMC at pH 8.3.
Bioorg Med Chem Lett 8: 1669-72 (1999)
BindingDB Entry DOI: 10.7270/Q2G73CV8