BDBM50215688 CHEMBL399773::sodium (3R,5R)-7-(5-((3-(dimethylcarbamoyl)phenyl)carbamoyl)-3,4-bis(4-fluorophenyl)-1-isopropyl-1H-pyrrol-2-yl)-3,5-dihydroxyheptanoate
SMILES: CC(C)n1c(CC[C@@H](O)C[C@@H](O)CC([O-])=O)c(c(c1C(=O)Nc1cccc(c1)C(=O)N(C)C)-c1ccc(F)cc1)-c1ccc(F)cc1
InChI Key: InChIKey=OXLOQDAJLIMHFR-FQLXRVMXSA-M
Data: 1 IC50
Activity Spreadsheet -- Enzyme Inhibition Constant Data from BindingDB
Found 1 hit for monomerid = 50215688
Trg + Lig
Ki
nM
ΔG°
kcal/mole
IC50
nM
Kd
nM
EC50/IC50
nM
koff
s-1
kon
M-1s-1
pHTemp
°C
3-hydroxy-3-methylglutaryl-coenzyme A reductase (HMG-CoA)
(Homo sapiens (Human))
BDBM50215688
(CHEMBL399773 | sodium (3R,5R)-7-(5-((3-(dimethylca...)
Show SMILES CC(C)n1c(CC[C@@H](O)C[C@@H](O)CC([O-])=O)c(c(c1C(=O)Nc1cccc(c1)C(=O)N(C)C)-c1ccc(F)cc1)-c1ccc(F)cc1
Show InChI InChI=1S/C36H39F2N3O6/c1-21(2)41-30(17-16-28(42)19-29(43)20-31(44)45)32(22-8-12-25(37)13-9-22)33(23-10-14-26(38)15-11-23)34(41)35(46)39-27-7-5-6-24(18-27)36(47)40(3)4/h5-15,18,21,28-29,42-43H,16-17,19-20H2,1-4H3,(H,39,46)(H,44,45)/p-1/t28-,29-/m1/s1
n/an/a 0.300n/an/an/an/an/an/a
Pfizer Global Research & Development
Curated by ChEMBL
Assay Description
Inhibition of HMG-CoA reductase
Bioorg Med Chem Lett 17: 4538-44 (2007)
Article DOI: 10.1016/j.bmcl.2007.05.096
BindingDB Entry DOI: 10.7270/Q2SJ1K9Q