BDBM50215690 CHEMBL399313::sodium (3R,5R)-7-(5-(benzylcarbamoyl)-3-(4-fluorophenyl)-1-isopropyl-4-phenyl-1H-pyrrol-2-yl)-3,5-dihydroxyheptanoate
SMILES: CC(C)n1c(CC[C@@H](O)C[C@@H](O)CC([O-])=O)c(c(c1C(=O)NCc1ccccc1)-c1ccccc1)-c1ccc(F)cc1
InChI Key: InChIKey=BJDYNYRRCXGZGR-VSGBNLITSA-M
Data: 1 IC50
Activity Spreadsheet -- Enzyme Inhibition Constant Data from BindingDB
Found 1 hit for monomerid = 50215690
Trg + Lig
Ki
nM
ΔG°
kcal/mole
IC50
nM
Kd
nM
EC50/IC50
nM
koff
s-1
kon
M-1s-1
pHTemp
°C
3-hydroxy-3-methylglutaryl-coenzyme A reductase (HMG-CoA)
(Homo sapiens (Human))
BDBM50215690
(CHEMBL399313 | sodium (3R,5R)-7-(5-(benzylcarbamoy...)
Show SMILES CC(C)n1c(CC[C@@H](O)C[C@@H](O)CC([O-])=O)c(c(c1C(=O)NCc1ccccc1)-c1ccccc1)-c1ccc(F)cc1
Show InChI InChI=1S/C34H37FN2O5/c1-22(2)37-29(18-17-27(38)19-28(39)20-30(40)41)31(25-13-15-26(35)16-14-25)32(24-11-7-4-8-12-24)33(37)34(42)36-21-23-9-5-3-6-10-23/h3-16,22,27-28,38-39H,17-21H2,1-2H3,(H,36,42)(H,40,41)/p-1/t27-,28-/m1/s1
n/an/a 0.800n/an/an/an/an/an/a
Pfizer Global Research & Development
Curated by ChEMBL
Assay Description
Inhibition of HMG-CoA reductase
Bioorg Med Chem Lett 17: 4538-44 (2007)
Article DOI: 10.1016/j.bmcl.2007.05.096
BindingDB Entry DOI: 10.7270/Q2SJ1K9Q