BDBM50215785 4-((2-((2,2-difluorobenzo[d][1,3]dioxol-5-yl)carbamoyl)phenylamino)methyl)-N-(3-methoxypropyl)picolinamide::CHEMBL247030
SMILES: COCCCNC(=O)c1cc(CNc2ccccc2C(=O)Nc2ccc3OC(F)(F)Oc3c2)ccn1
InChI Key: InChIKey=BLXZMOITRCHHRV-UHFFFAOYSA-N
Data: 2 IC50
Activity Spreadsheet -- Enzyme Inhibition Constant Data from BindingDB
Found 2 hits for monomerid = 50215785
Trg + Lig
Ki
nM
ΔG°
kcal/mole
IC50
nM
Kd
nM
EC50/IC50
nM
koff
s-1
kon
M-1s-1
pHTemp
°C
Mast/stem cell growth factor receptor Kit
(Homo sapiens (Human))
BDBM50215785
(4-((2-((2,2-difluorobenzo[d][1,3]dioxol-5-yl)carba...)
Show SMILES COCCCNC(=O)c1cc(CNc2ccccc2C(=O)Nc2ccc3OC(F)(F)Oc3c2)ccn1
Show InChI InChI=1S/C25H24F2N4O5/c1-34-12-4-10-29-24(33)20-13-16(9-11-28-20)15-30-19-6-3-2-5-18(19)23(32)31-17-7-8-21-22(14-17)36-25(26,27)35-21/h2-3,5-9,11,13-14,30H,4,10,12,15H2,1H3,(H,29,33)(H,31,32)
n/an/a 19n/an/an/an/an/an/a
Bayer Research Center
Curated by ChEMBL
Assay Description
Inhibition of human recombinant cKit by FRET assay
Bioorg Med Chem Lett 17: 4378-81 (2007)
Article DOI: 10.1016/j.bmcl.2007.02.075
BindingDB Entry DOI: 10.7270/Q28K78S7
Serine/threonine-protein kinase B-raf
(Homo sapiens (Human))
BDBM50215785
(4-((2-((2,2-difluorobenzo[d][1,3]dioxol-5-yl)carba...)
Show SMILES COCCCNC(=O)c1cc(CNc2ccccc2C(=O)Nc2ccc3OC(F)(F)Oc3c2)ccn1
Show InChI InChI=1S/C25H24F2N4O5/c1-34-12-4-10-29-24(33)20-13-16(9-11-28-20)15-30-19-6-3-2-5-18(19)23(32)31-17-7-8-21-22(14-17)36-25(26,27)35-21/h2-3,5-9,11,13-14,30H,4,10,12,15H2,1H3,(H,29,33)(H,31,32)
NCI pathway
Reactome pathway
n/an/a 1.03E+3n/an/an/an/an/an/a
Bayer Research Center
Curated by ChEMBL
Assay Description
Inhibition of b-Raf
Bioorg Med Chem Lett 17: 4378-81 (2007)
Article DOI: 10.1016/j.bmcl.2007.02.075
BindingDB Entry DOI: 10.7270/Q28K78S7