BDBM50215789 1-(4-((2-((2,2-difluorobenzo[d][1,3]dioxol-5-yl)carbamoyl)phenylamino)methyl)pyridin-2-yl)-3-ethylurea::CHEMBL247793
SMILES: CCNC(=O)Nc1cc(CNc2ccccc2C(=O)Nc2ccc3OC(F)(F)Oc3c2)ccn1
InChI Key: InChIKey=ACBAZTUYTSKGTP-UHFFFAOYSA-N
Data: 2 IC50
Activity Spreadsheet -- Enzyme Inhibition Constant Data from BindingDB
Found 2 hits for monomerid = 50215789
Trg + Lig
Ki
nM
ΔG°
kcal/mole
IC50
nM
Kd
nM
EC50/IC50
nM
koff
s-1
kon
M-1s-1
pHTemp
°C
Mast/stem cell growth factor receptor Kit
(Homo sapiens (Human))
BDBM50215789
(1-(4-((2-((2,2-difluorobenzo[d][1,3]dioxol-5-yl)ca...)
Show SMILES CCNC(=O)Nc1cc(CNc2ccccc2C(=O)Nc2ccc3OC(F)(F)Oc3c2)ccn1
Show InChI InChI=1S/C23H21F2N5O4/c1-2-26-22(32)30-20-11-14(9-10-27-20)13-28-17-6-4-3-5-16(17)21(31)29-15-7-8-18-19(12-15)34-23(24,25)33-18/h3-12,28H,2,13H2,1H3,(H,29,31)(H2,26,27,30,32)
n/an/a 7n/an/an/an/an/an/a
Bayer Research Center
Curated by ChEMBL
Assay Description
Inhibition of human recombinant cKit by FRET assay
Bioorg Med Chem Lett 17: 4378-81 (2007)
Article DOI: 10.1016/j.bmcl.2007.02.075
BindingDB Entry DOI: 10.7270/Q28K78S7
Serine/threonine-protein kinase B-raf
(Homo sapiens (Human))
BDBM50215789
(1-(4-((2-((2,2-difluorobenzo[d][1,3]dioxol-5-yl)ca...)
Show SMILES CCNC(=O)Nc1cc(CNc2ccccc2C(=O)Nc2ccc3OC(F)(F)Oc3c2)ccn1
Show InChI InChI=1S/C23H21F2N5O4/c1-2-26-22(32)30-20-11-14(9-10-27-20)13-28-17-6-4-3-5-16(17)21(31)29-15-7-8-18-19(12-15)34-23(24,25)33-18/h3-12,28H,2,13H2,1H3,(H,29,31)(H2,26,27,30,32)
NCI pathway
Reactome pathway
n/an/a 90n/an/an/an/an/an/a
Bayer Research Center
Curated by ChEMBL
Assay Description
Inhibition of b-Raf
Bioorg Med Chem Lett 17: 4378-81 (2007)
Article DOI: 10.1016/j.bmcl.2007.02.075
BindingDB Entry DOI: 10.7270/Q28K78S7