BDBM50215868 CHEMBL51535
SMILES: NS(=O)(=O)c1ccc(F)cc1-c1ccc2[C@H](O)[C@@H](Cc3ccccc3)COc2c1
InChI Key: InChIKey=UUICILBXPJNMBR-KSFYIVLOSA-N
Data: 4 IC50
Activity Spreadsheet -- Enzyme Inhibition Constant Data from BindingDB
Found 4 hits for monomerid = 50215868
Trg + Lig
Ki
nM
ΔG°
kcal/mole
IC50
nM
Kd
nM
EC50/IC50
nM
koff
s-1
kon
M-1s-1
pHTemp
°C
Leukotriene B4 receptor
(Homo sapiens (Human))
BDBM50215868
(CHEMBL51535)
Show SMILES NS(=O)(=O)c1ccc(F)cc1-c1ccc2[C@H](O)[C@@H](Cc3ccccc3)COc2c1
Show InChI InChI=1S/C22H20FNO4S/c23-17-7-9-21(29(24,26)27)19(12-17)15-6-8-18-20(11-15)28-13-16(22(18)25)10-14-4-2-1-3-5-14/h1-9,11-12,16,22,25H,10,13H2,(H2,24,26,27)/t16-,22+/m0/s1
n/an/a 540n/an/an/an/an/an/a
Pfizer Inc
Curated by ChEMBL
Assay Description
Ability to inhibit LTB4-induced CD11b up-regulation on isolated human neutrophils
Bioorg Med Chem Lett 8: 1781-6 (1998)
BindingDB Entry DOI: 10.7270/Q2RR21F1
Leukotriene B4 receptor
(Homo sapiens (Human))
BDBM50215868
(CHEMBL51535)
Show SMILES NS(=O)(=O)c1ccc(F)cc1-c1ccc2[C@H](O)[C@@H](Cc3ccccc3)COc2c1
Show InChI InChI=1S/C22H20FNO4S/c23-17-7-9-21(29(24,26)27)19(12-17)15-6-8-18-20(11-15)28-13-16(22(18)25)10-14-4-2-1-3-5-14/h1-9,11-12,16,22,25H,10,13H2,(H2,24,26,27)/t16-,22+/m0/s1
n/an/a 17n/an/an/an/an/an/a
Pfizer Inc
Curated by ChEMBL
Assay Description
Ability to inhibit LTB4-induced chemotaxis of isolated human neutrophils.
Bioorg Med Chem Lett 8: 1781-6 (1998)
BindingDB Entry DOI: 10.7270/Q2RR21F1
Leukotriene B4 receptor
(Homo sapiens (Human))
BDBM50215868
(CHEMBL51535)
Show SMILES NS(=O)(=O)c1ccc(F)cc1-c1ccc2[C@H](O)[C@@H](Cc3ccccc3)COc2c1
Show InChI InChI=1S/C22H20FNO4S/c23-17-7-9-21(29(24,26)27)19(12-17)15-6-8-18-20(11-15)28-13-16(22(18)25)10-14-4-2-1-3-5-14/h1-9,11-12,16,22,25H,10,13H2,(H2,24,26,27)/t16-,22+/m0/s1
n/an/a>1.00E+4n/an/an/an/an/an/a
Pfizer Inc
Curated by ChEMBL
Assay Description
Ability to inhibit LTB4-induced CD11b up-regulation on isolated human neutrophils in whole blood
Bioorg Med Chem Lett 8: 1781-6 (1998)
BindingDB Entry DOI: 10.7270/Q2RR21F1
Leukotriene B4 receptor
(Homo sapiens (Human))
BDBM50215868
(CHEMBL51535)
Show SMILES NS(=O)(=O)c1ccc(F)cc1-c1ccc2[C@H](O)[C@@H](Cc3ccccc3)COc2c1
Show InChI InChI=1S/C22H20FNO4S/c23-17-7-9-21(29(24,26)27)19(12-17)15-6-8-18-20(11-15)28-13-16(22(18)25)10-14-4-2-1-3-5-14/h1-9,11-12,16,22,25H,10,13H2,(H2,24,26,27)/t16-,22+/m0/s1
n/an/a 37n/an/an/an/an/an/a
Pfizer Inc
Curated by ChEMBL
Assay Description
Ability to inhibit LTB4 binding to LTB receptors on isolated human neutrophils.
Bioorg Med Chem Lett 8: 1781-6 (1998)
BindingDB Entry DOI: 10.7270/Q2RR21F1