BDBM50215948 CHEMBL54361
SMILES: Cc1cn(CCCc2ccccc2)c2cc(ccc12)C(=O)Nc1c(Cl)cncc1Cl
InChI Key: InChIKey=WZZXQGHMUNKNST-UHFFFAOYSA-N
Data: 1 KI  1 IC50
Activity Spreadsheet -- Enzyme Inhibition Constant Data from BindingDB
Found 2 hits for monomerid = 50215948
Trg + Lig
Ki
nM
ΔG°
kcal/mole
IC50
nM
Kd
nM
EC50/IC50
nM
koff
s-1
kon
M-1s-1
pHTemp
°C
Phosphodiesterase 4
(Homo sapiens (Human))
BDBM50215948
(CHEMBL54361)
Show SMILES Cc1cn(CCCc2ccccc2)c2cc(ccc12)C(=O)Nc1c(Cl)cncc1Cl
Show InChI InChI=1S/C24H21Cl2N3O/c1-16-15-29(11-5-8-17-6-3-2-4-7-17)22-12-18(9-10-19(16)22)24(30)28-23-20(25)13-27-14-21(23)26/h2-4,6-7,9-10,12-15H,5,8,11H2,1H3,(H,27,28,30)
41n/an/an/an/an/an/an/an/a
Rh£ne-Poulenc Rorer Central Research
Curated by ChEMBL
Assay Description
Binding affinity against PDE4 was determined using [3H]- rolipram in guinea pig brain membrane binding assay
Bioorg Med Chem Lett 8: 1867-72 (1998)
BindingDB Entry DOI: 10.7270/Q2CJ8GPB
Phosphodiesterase 4
(Homo sapiens (Human))
BDBM50215948
(CHEMBL54361)
Show SMILES Cc1cn(CCCc2ccccc2)c2cc(ccc12)C(=O)Nc1c(Cl)cncc1Cl
Show InChI InChI=1S/C24H21Cl2N3O/c1-16-15-29(11-5-8-17-6-3-2-4-7-17)22-12-18(9-10-19(16)22)24(30)28-23-20(25)13-27-14-21(23)26/h2-4,6-7,9-10,12-15H,5,8,11H2,1H3,(H,27,28,30)
n/an/a 25n/an/an/an/an/an/a
Rh£ne-Poulenc Rorer Central Research
Curated by ChEMBL
Assay Description
Inhibitory activity against Phosphodiesterase type IV (PDE4) obtained from guinea-pig macrophage was evaluated
Bioorg Med Chem Lett 8: 1867-72 (1998)
BindingDB Entry DOI: 10.7270/Q2CJ8GPB