BDBM50216189 CHEMBL233166::N-(3-chlorophenethyl)-4-isopropoxy-N-(pyrrolidin-3-yl)benzamide
SMILES: CC(C)Oc1ccc(cc1)C(=O)N(CCc1cccc(Cl)c1)C1CCNC1
InChI Key: InChIKey=KWEUAJVHHBNKAT-UHFFFAOYSA-N
Data: 1 IC50
Activity Spreadsheet -- Enzyme Inhibition Constant Data from BindingDB
Found 1 hit for monomerid = 50216189
Trg + Lig
Ki
nM
ΔG°
kcal/mole
IC50
nM
Kd
nM
EC50/IC50
nM
koff
s-1
kon
M-1s-1
pHTemp
°C
Membrane-bound transcription factor site-1 protease
(Homo sapiens (Human))
BDBM50216189
(CHEMBL233166 | N-(3-chlorophenethyl)-4-isopropoxy-...)
Show SMILES CC(C)Oc1ccc(cc1)C(=O)N(CCc1cccc(Cl)c1)C1CCNC1 |w:22.23|
Show InChI InChI=1S/C22H27ClN2O2/c1-16(2)27-21-8-6-18(7-9-21)22(26)25(20-10-12-24-15-20)13-11-17-4-3-5-19(23)14-17/h3-9,14,16,20,24H,10-13,15H2,1-2H3
Reactome pathway
n/an/a 9.60E+3n/an/an/an/an/an/a
Pfizer Global Research and Development-Groton Laboratories
Curated by ChEMBL
Assay Description
Inhibition of human S1P expressed in CHOK1 cells
Bioorg Med Chem Lett 17: 4411-4 (2007)
Article DOI: 10.1016/j.bmcl.2007.06.031
BindingDB Entry DOI: 10.7270/Q26M36JG