BDBM50216196 CHEMBL231776::N-(2-methoxyphenethyl)-4-((diethylamino)methyl)-N-(pyrrolidin-3-yl)benzamide
SMILES: CCN(CC)Cc1ccc(cc1)C(=O)N(CCc1ccccc1OC)C1CCNC1
InChI Key: InChIKey=XKPJTOHUPQWSOJ-UHFFFAOYSA-N
Data: 1 IC50
Activity Spreadsheet -- Enzyme Inhibition Constant Data from BindingDB
Found 1 hit for monomerid = 50216196
Trg + Lig
Ki
nM
ΔG°
kcal/mole
IC50
nM
Kd
nM
EC50/IC50
nM
koff
s-1
kon
M-1s-1
pHTemp
°C
Membrane-bound transcription factor site-1 protease
(Homo sapiens (Human))
BDBM50216196
(CHEMBL231776 | N-(2-methoxyphenethyl)-4-((diethyla...)
Show SMILES CCN(CC)Cc1ccc(cc1)C(=O)N(CCc1ccccc1OC)C1CCNC1 |w:25.26|
Show InChI InChI=1S/C25H35N3O2/c1-4-27(5-2)19-20-10-12-22(13-11-20)25(29)28(23-14-16-26-18-23)17-15-21-8-6-7-9-24(21)30-3/h6-13,23,26H,4-5,14-19H2,1-3H3
Reactome pathway
n/an/a 540n/an/an/an/an/an/a
Pfizer Global Research and Development-Groton Laboratories
Curated by ChEMBL
Assay Description
Inhibition of human S1P expressed in CHOK1 cells
Bioorg Med Chem Lett 17: 4411-4 (2007)
Article DOI: 10.1016/j.bmcl.2007.06.031
BindingDB Entry DOI: 10.7270/Q26M36JG