BDBM50216205 CHEMBL233574::N-(2-chlorobenzyl)-4-isopropoxy-N-(pyrrolidin-3-yl)benzamide
SMILES: CC(C)Oc1ccc(cc1)C(=O)N(Cc1ccccc1Cl)C1CCNC1
InChI Key: InChIKey=PXWUXUQDTWMHMK-UHFFFAOYSA-N
Data: 1 IC50
Activity Spreadsheet -- Enzyme Inhibition Constant Data from BindingDB
Found 1 hit for monomerid = 50216205
Trg + Lig
Ki
nM
ΔG°
kcal/mole
IC50
nM
Kd
nM
EC50/IC50
nM
koff
s-1
kon
M-1s-1
pHTemp
°C
Membrane-bound transcription factor site-1 protease
(Homo sapiens (Human))
BDBM50216205
(CHEMBL233574 | N-(2-chlorobenzyl)-4-isopropoxy-N-(...)
Show SMILES CC(C)Oc1ccc(cc1)C(=O)N(Cc1ccccc1Cl)C1CCNC1 |w:21.22|
Show InChI InChI=1S/C21H25ClN2O2/c1-15(2)26-19-9-7-16(8-10-19)21(25)24(18-11-12-23-13-18)14-17-5-3-4-6-20(17)22/h3-10,15,18,23H,11-14H2,1-2H3
Reactome pathway
n/an/a>5.00E+3n/an/an/an/an/an/a
Pfizer Global Research and Development-Groton Laboratories
Curated by ChEMBL
Assay Description
Inhibition of human S1P expressed in CHOK1 cells
Bioorg Med Chem Lett 17: 4411-4 (2007)
Article DOI: 10.1016/j.bmcl.2007.06.031
BindingDB Entry DOI: 10.7270/Q26M36JG