BDBM50216686 3-(5-(2-chlorophenyl)furan-2-yl)-2-cyano-N-(quinolin-8-yl)acrylamide::CHEMBL225971
SMILES: Clc1ccccc1-c1ccc(\C=C(/C#N)C(=O)Nc2cccc3cccnc23)o1
InChI Key: InChIKey=XPCOAVYCHRMBET-DTQAZKPQSA-N
Data: 3 IC50
Activity Spreadsheet -- Enzyme Inhibition Constant Data from BindingDB
Found 3 hits for monomerid = 50216686
Trg + Lig
Ki
nM
ΔG°
kcal/mole
IC50
nM
Kd
nM
EC50/IC50
nM
koff
s-1
kon
M-1s-1
pHTemp
°C
NAD-dependent deacetylase sirtuin 2
(Homo sapiens (Human))
BDBM50216686
(3-(5-(2-chlorophenyl)furan-2-yl)-2-cyano-N-(quinol...)
Show SMILES Clc1ccccc1-c1ccc(\C=C(/C#N)C(=O)Nc2cccc3cccnc23)o1
Show InChI InChI=1S/C23H14ClN3O2/c24-19-8-2-1-7-18(19)21-11-10-17(29-21)13-16(14-25)23(28)27-20-9-3-5-15-6-4-12-26-22(15)20/h1-13H,(H,27,28)/b16-13+
NCI pathway
n/an/a>5.00E+4n/an/an/an/an/an/a
Harvard Medical School
Curated by ChEMBL
Assay Description
Inhibition of human recombinant SIRT2 using fluorescent peptide substrate by fluorescent assay
Science 317: 516-9 (2007)
Article DOI: 10.1126/science.1143780
BindingDB Entry DOI: 10.7270/Q2D50MPG
NAD-dependent protein deacetylase sirtuin-3 (SIRT3)
(Homo sapiens (Human))
BDBM50216686
(3-(5-(2-chlorophenyl)furan-2-yl)-2-cyano-N-(quinol...)
Show SMILES Clc1ccccc1-c1ccc(\C=C(/C#N)C(=O)Nc2cccc3cccnc23)o1
Show InChI InChI=1S/C23H14ClN3O2/c24-19-8-2-1-7-18(19)21-11-10-17(29-21)13-16(14-25)23(28)27-20-9-3-5-15-6-4-12-26-22(15)20/h1-13H,(H,27,28)/b16-13+
n/an/a>5.00E+4n/an/an/an/an/an/a
Harvard Medical School
Curated by ChEMBL
Assay Description
Inhibition of human recombinant SIRT3 using fluorescent peptide substrate by fluorescent assay
Science 317: 516-9 (2007)
Article DOI: 10.1126/science.1143780
BindingDB Entry DOI: 10.7270/Q2D50MPG
NAD-Dependent Deacetylase Sirtuin-1
(Homo sapiens (Human))
BDBM50216686
(3-(5-(2-chlorophenyl)furan-2-yl)-2-cyano-N-(quinol...)
Show SMILES Clc1ccccc1-c1ccc(\C=C(/C#N)C(=O)Nc2cccc3cccnc23)o1
Show InChI InChI=1S/C23H14ClN3O2/c24-19-8-2-1-7-18(19)21-11-10-17(29-21)13-16(14-25)23(28)27-20-9-3-5-15-6-4-12-26-22(15)20/h1-13H,(H,27,28)/b16-13+
NCI pathway
Reactome pathway
n/an/a>5.00E+4n/an/an/an/an/an/a
Harvard Medical School
Curated by ChEMBL
Assay Description
Inhibition of human recombinant SIRT1 using fluorescent peptide substrate by fluorescent assay
Science 317: 516-9 (2007)
Article DOI: 10.1126/science.1143780
BindingDB Entry DOI: 10.7270/Q2D50MPG