BDBM50216750 5-(2-methylquinolin-7-yl)isophthalonitrile::CHEMBL231788
SMILES: Cc1ccc2ccc(cc2n1)-c1cc(cc(c1)C#N)C#N
InChI Key: InChIKey=KVBFHKKSOXHZCJ-UHFFFAOYSA-N
Data: 1 IC50
Activity Spreadsheet -- Enzyme Inhibition Constant Data from BindingDB
Found 1 hit for monomerid = 50216750
Trg + Lig
Ki
nM
ΔG°
kcal/mole
IC50
nM
Kd
nM
EC50/IC50
nM
koff
s-1
kon
M-1s-1
pHTemp
°C
Metabotropic glutamate receptor 5
(Rattus norvegicus (Rat))
BDBM50216750
(5-(2-methylquinolin-7-yl)isophthalonitrile | CHEMB...)
Show SMILES Cc1ccc2ccc(cc2n1)-c1cc(cc(c1)C#N)C#N
Show InChI InChI=1S/C18H11N3/c1-12-2-3-15-4-5-16(9-18(15)21-12)17-7-13(10-19)6-14(8-17)11-20/h2-9H,1H3
Reactome pathway
n/an/a 2n/an/an/an/an/an/a
Pfizer Global Research and Development
Curated by ChEMBL
Assay Description
Activity at rat mGlu5 receptor expressed in CHO cells assessed as inhibition of quisqualate-stimulated calcium mobilization by FLIPR assay
Bioorg Med Chem Lett 17: 4415-8 (2007)
Article DOI: 10.1016/j.bmcl.2007.06.030
BindingDB Entry DOI: 10.7270/Q28G8KDC