BDBM50216758 3-methyl-5-(2-methylquinolin-7-yl)benzonitrile::CHEMBL232189
SMILES: Cc1cc(cc(c1)-c1ccc2ccc(C)nc2c1)C#N
InChI Key: InChIKey=FSRORMXGJWDWBA-UHFFFAOYSA-N
Data: 1 IC50
Activity Spreadsheet -- Enzyme Inhibition Constant Data from BindingDB
Found 1 hit for monomerid = 50216758
Trg + Lig
Ki
nM
ΔG°
kcal/mole
IC50
nM
Kd
nM
EC50/IC50
nM
koff
s-1
kon
M-1s-1
pHTemp
°C
Metabotropic glutamate receptor 5
(Rattus norvegicus (Rat))
BDBM50216758
(3-methyl-5-(2-methylquinolin-7-yl)benzonitrile | C...)
Show SMILES Cc1cc(cc(c1)-c1ccc2ccc(C)nc2c1)C#N
Show InChI InChI=1S/C18H14N2/c1-12-7-14(11-19)9-17(8-12)16-6-5-15-4-3-13(2)20-18(15)10-16/h3-10H,1-2H3
Reactome pathway
n/an/a 1.60n/an/an/an/an/an/a
Pfizer Global Research and Development
Curated by ChEMBL
Assay Description
Activity at rat mGlu5 receptor expressed in CHO cells assessed as inhibition of quisqualate-stimulated calcium mobilization by FLIPR assay
Bioorg Med Chem Lett 17: 4415-8 (2007)
Article DOI: 10.1016/j.bmcl.2007.06.030
BindingDB Entry DOI: 10.7270/Q28G8KDC