null
SMILES: CC(C)[C@]1(CCc2ccc(O)cc2)CC(=O)C(Sc2sc3ccccc3c2C(C)(C)C)=C(O)O1
InChI Key: InChIKey=ZQKACQVOBUUWNB-NDEPHWFRSA-N
Activity Spreadsheet -- Enzyme Inhibition Constant Data from BindingDB
Found 2 hits for monomerid = 50216785
Trg + Lig
Ki
nM
ΔG°
kcal/mole
IC50
nM
Kd
nM
EC50/IC50
nM
koff
s-1
kon
M-1s-1
pHTemp
°C
Gag-Pol polyprotein [489-587]
(Human immunodeficiency virus type 1)
BDBM50216785
(CHEMBL61756)
Show SMILES CC(C)[C@]1(CCc2ccc(O)cc2)CC(=O)C(Sc2sc3ccccc3c2C(C)(C)C)=C(O)O1 |t:33|
Show InChI InChI=1S/C28H32O4S2/c1-17(2)28(15-14-18-10-12-19(29)13-11-18)16-21(30)24(25(31)32-28)34-26-23(27(3,4)5)20-8-6-7-9-22(20)33-26/h6-13,17,29,31H,14-16H2,1-5H3/t28-/m0/s1
<0.100n/an/an/an/an/an/a4.7n/a
Warner-Lambert Company
Curated by ChEMBL
Assay Description
Inhibitory activity of the compound was evaluated against human immunodeficiency virus type 1(HIV-1) protease at pH 6.2
Bioorg Med Chem Lett 9: 2019-24 (1999)
BindingDB Entry DOI: 10.7270/Q2PZ5814
Gag-Pol polyprotein [489-587]
(Human immunodeficiency virus type 1)
BDBM50216785
(CHEMBL61756)
Show SMILES CC(C)[C@]1(CCc2ccc(O)cc2)CC(=O)C(Sc2sc3ccccc3c2C(C)(C)C)=C(O)O1 |t:33|
Show InChI InChI=1S/C28H32O4S2/c1-17(2)28(15-14-18-10-12-19(29)13-11-18)16-21(30)24(25(31)32-28)34-26-23(27(3,4)5)20-8-6-7-9-22(20)33-26/h6-13,17,29,31H,14-16H2,1-5H3/t28-/m0/s1
n/an/a<1n/an/an/an/a6.2n/a
Warner-Lambert Company
Curated by ChEMBL
Assay Description
Inhibitory concentration against human immunodeficiency virus type 1(HIV-1) protease at pH 4.7
Bioorg Med Chem Lett 9: 2019-24 (1999)
BindingDB Entry DOI: 10.7270/Q2PZ5814