BDBM50216821 (3R)-6-cyclohexyl-3-{3-[(ethylamino)methyl]-1,2,4-oxadiazol-5-yl}-Nhydroxyhexanamide::CHEMBL229380
SMILES: CCNCc1noc(n1)[C@H](CCCC1CCCCC1)CC(=O)NO
InChI Key: InChIKey=QRHQSYVRXDFFRK-CQSZACIVSA-N
Data: 1 IC50
Activity Spreadsheet -- Enzyme Inhibition Constant Data from BindingDB
Found 1 hit for monomerid = 50216821
Trg + Lig
Ki
nM
ΔG°
kcal/mole
IC50
nM
Kd
nM
EC50/IC50
nM
koff
s-1
kon
M-1s-1
pHTemp
°C
Bone morphogenetic protein 1
(Homo sapiens (Human))
BDBM50216821
((3R)-6-cyclohexyl-3-{3-[(ethylamino)methyl]-1,2,4-...)
Show SMILES CCNCc1noc(n1)[C@H](CCCC1CCCCC1)CC(=O)NO
Show InChI InChI=1S/C17H30N4O3/c1-2-18-12-15-19-17(24-21-15)14(11-16(22)20-23)10-6-9-13-7-4-3-5-8-13/h13-14,18,23H,2-12H2,1H3,(H,20,22)/t14-/m1/s1
Reactome pathway
n/an/a 21n/an/an/an/an/an/a
Pfizer Global Research and Development
Curated by ChEMBL
Assay Description
Inhibition of human procollagen C-proteinase expressed in CHO cells
J Med Chem 50: 3442-56 (2007)
Article DOI: 10.1021/jm061010z
BindingDB Entry DOI: 10.7270/Q2W66KGB