null
SMILES: CS(=O)(=O)Nc1ccc(cc1)-c1noc(n1)[C@H](CCCC1CCCCC1)CC(=O)NO
InChI Key: InChIKey=CSYVKNCZXAFYBA-QGZVFWFLSA-N
Activity Spreadsheet -- Enzyme Inhibition Constant Data from BindingDB
Found 1 hit for monomerid = 50216824
Trg + Lig
Ki
nM
ΔG°
kcal/mole
IC50
nM
Kd
nM
EC50/IC50
nM
koff
s-1
kon
M-1s-1
pHTemp
°C
Bone morphogenetic protein 1
(Homo sapiens (Human))
BDBM50216824
((3R)-6-cyclohexyl-N-hydroxy-3-(3-{4-[(methylsulfon...)
Show SMILES CS(=O)(=O)Nc1ccc(cc1)-c1noc(n1)[C@H](CCCC1CCCCC1)CC(=O)NO
Show InChI InChI=1S/C21H30N4O5S/c1-31(28,29)25-18-12-10-16(11-13-18)20-22-21(30-24-20)17(14-19(26)23-27)9-5-8-15-6-3-2-4-7-15/h10-13,15,17,25,27H,2-9,14H2,1H3,(H,23,26)/t17-/m1/s1
Reactome pathway
n/an/a 3n/an/an/an/an/an/a
Pfizer Global Research and Development
Curated by ChEMBL
Assay Description
Inhibition of human procollagen C-proteinase expressed in CHO cells
J Med Chem 50: 3442-56 (2007)
Article DOI: 10.1021/jm061010z
BindingDB Entry DOI: 10.7270/Q2W66KGB